{"text_format":"1","workbook":"xlsx","n_sheets":9,"sheets":["CLASSEMENT","EQUIPES","EKC1","EKC2","EKC3","EKC4","EKC5","MODELE","Feuil3"],"not_rendered":{"charts":0,"images":0,"macros":1,"external_links":1,"defined_names":0,"comments":0,"pivot_tables":0},"unopened":[],"bounds":{"document_bytes":16777216,"sheet_cells":100000,"rows_first":2000,"rows_last":500,"rows_between":2000,"halvings":0,"cell_chars":16384,"cell_head_chars":4096},"cells_cut":0,"cells_raw":0,"read":"whole","date_system":"1900"}

{"sheet":"CLASSEMENT","index":0,"n_rows":103,"n_cols":9,"rows_kept":103,"cut":false,"hidden":false,"merged":[]}
[null,null,"Nbr","Nbr","EKC 1 -RKC","EKC 2 - Circuit Europe","EKC 3 - Cap Karting","EKC 4 - Dunois Kart","EKC 5 - RKC"]
[null,null,"de ","de ",{"$f":"'EKC1'!AB3&\" équipes\"","v":"16 équipes"},{"$f":"'EKC2'!AB3&\" équipes\"","v":"0 équipes"},{"$f":"'EKC3'!AB3&\" équipes\"","v":"0 équipes"},{"$f":"'EKC4'!AB3&\" équipes\"","v":"0 équipes"},{"$f":"'EKC5'!AB3&\" équipes\"","v":"0 équipes"}]
["Clst","Equipes","Points","Courses","2 X  30mn  / 2H","2 X  30mn  / 2H","2 X  30mn  / 2H","2 X  30mn  / 2H","2 X  30mn  / 2H"]
[1,{"$f":"IF(EQUIPES!G10>0,EQUIPES!A10,\"\")","v":"JOKER TEAM"},{"$f":"SUM(E4:I4)","v":38},{"$f":"IF((COUNTIF(E4:I4,\">0\"))=0,\"\",COUNTIF(E4:I4,\">0\"))","v":1},{"$f":"IF(ISNA(VLOOKUP($B4,'EKC1'!$P$4:$U$48,6,FALSE)),\" \",VLOOKUP($B4,'EKC1'!$P$4:$U$48,6,FALSE))","v":38},{"$f":"IF(ISNA(VLOOKUP($B4,'EKC2'!$P$4:$V$48,6,FALSE)),\" \",VLOOKUP($B4,'EKC2'!$P$4:$V$48,6,FALSE))","v":" "},{"$f":"IF(ISNA(VLOOKUP($B4,'EKC3'!$P$4:$V$48,6,FALSE)),\" \",VLOOKUP($B4,'EKC3'!$P$4:$V$48,6,FALSE))","v":" "},{"$f":"IF(ISNA(VLOOKUP($B4,'EKC4'!$P$4:$V$48,6,FALSE)),\" \",VLOOKUP($B4,'EKC4'!$P$4:$V$48,6,FALSE))","v":" "},{"$f":"IF(ISNA(VLOOKUP($B4,'EKC5'!$P$4:$V$48,6,FALSE)),\" \",VLOOKUP($B4,'EKC5'!$P$4:$V$48,6,FALSE))","v":" "}]
[2,{"$f":"IF(EQUIPES!G6>0,EQUIPES!A6,\"\")","v":"ESSO SPORT"},33,1,{"$f":"IF(ISNA(VLOOKUP($B5,'EKC1'!$P$4:$U$48,6,FALSE)),\" \",VLOOKUP($B5,'EKC1'!$P$4:$U$48,6,FALSE))","v":33},{"$f":"IF(ISNA(VLOOKUP($B5,'EKC2'!$P$4:$V$48,6,FALSE)),\" \",VLOOKUP($B5,'EKC2'!$P$4:$V$48,6,FALSE))","v":" "},{"$f":"IF(ISNA(VLOOKUP($B5,'EKC3'!$P$4:$V$48,6,FALSE)),\" \",VLOOKUP($B5,'EKC3'!$P$4:$V$48,6,FALSE))","v":" "},{"$f":"IF(ISNA(VLOOKUP($B5,'EKC4'!$P$4:$V$48,6,FALSE)),\" \",VLOOKUP($B5,'EKC4'!$P$4:$V$48,6,FALSE))","v":" "},{"$f":"IF(ISNA(VLOOKUP($B5,'EKC5'!$P$4:$V$48,6,FALSE)),\" \",VLOOKUP($B5,'EKC5'!$P$4:$V$48,6,FALSE))","v":" "}]
[3,{"$f":"IF(EQUIPES!G17>0,EQUIPES!A17,\"\")","v":"TEAM TIME PENALTY"},32,1,{"$f":"IF(ISNA(VLOOKUP($B6,'EKC1'!$P$4:$U$48,6,FALSE)),\" \",VLOOKUP($B6,'EKC1'!$P$4:$U$48,6,FALSE))","v":32},{"$f":"IF(ISNA(VLOOKUP($B6,'EKC2'!$P$4:$V$48,6,FALSE)),\" \",VLOOKUP($B6,'EKC2'!$P$4:$V$48,6,FALSE))","v":" "},{"$f":"IF(ISNA(VLOOKUP($B6,'EKC3'!$P$4:$V$48,6,FALSE)),\" \",VLOOKUP($B6,'EKC3'!$P$4:$V$48,6,FALSE))","v":" "},{"$f":"IF(ISNA(VLOOKUP($B6,'EKC4'!$P$4:$V$48,6,FALSE)),\" \",VLOOKUP($B6,'EKC4'!$P$4:$V$48,6,FALSE))","v":" "},{"$f":"IF(ISNA(VLOOKUP($B6,'EKC5'!$P$4:$V$48,6,FALSE)),\" \",VLOOKUP($B6,'EKC5'!$P$4:$V$48,6,FALSE))","v":" "}]
[4,{"$f":"IF(EQUIPES!G13>0,EQUIPES!A13,\"\")","v":"MODAVE MRK PRO"},30,1,{"$f":"IF(ISNA(VLOOKUP($B7,'EKC1'!$P$4:$U$48,6,FALSE)),\" \",VLOOKUP($B7,'EKC1'!$P$4:$U$48,6,FALSE))","v":30},{"$f":"IF(ISNA(VLOOKUP($B7,'EKC2'!$P$4:$V$48,6,FALSE)),\" \",VLOOKUP($B7,'EKC2'!$P$4:$V$48,6,FALSE))","v":" "},{"$f":"IF(ISNA(VLOOKUP($B7,'EKC3'!$P$4:$V$48,6,FALSE)),\" \",VLOOKUP($B7,'EKC3'!$P$4:$V$48,6,FALSE))","v":" "},{"$f":"IF(ISNA(VLOOKUP($B7,'EKC4'!$P$4:$V$48,6,FALSE)),\" \",VLOOKUP($B7,'EKC4'!$P$4:$V$48,6,FALSE))","v":" "},{"$f":"IF(ISNA(VLOOKUP($B7,'EKC5'!$P$4:$V$48,6,FALSE)),\" \",VLOOKUP($B7,'EKC5'!$P$4:$V$48,6,FALSE))","v":" "}]
[5,{"$f":"IF(EQUIPES!G3>0,EQUIPES!A3,\"\")","v":"ALFA ROMEO RACING"},29,1,{"$f":"IF(ISNA(VLOOKUP($B8,'EKC1'!$P$4:$U$48,6,FALSE)),\" \",VLOOKUP($B8,'EKC1'!$P$4:$U$48,6,FALSE))","v":29},{"$f":"IF(ISNA(VLOOKUP($B8,'EKC2'!$P$4:$V$48,6,FALSE)),\" \",VLOOKUP($B8,'EKC2'!$P$4:$V$48,6,FALSE))","v":" "},{"$f":"IF(ISNA(VLOOKUP($B8,'EKC3'!$P$4:$V$48,6,FALSE)),\" \",VLOOKUP($B8,'EKC3'!$P$4:$V$48,6,FALSE))","v":" "},{"$f":"IF(ISNA(VLOOKUP($B8,'EKC4'!$P$4:$V$48,6,FALSE)),\" \",VLOOKUP($B8,'EKC4'!$P$4:$V$48,6,FALSE))","v":" "},{"$f":"IF(ISNA(VLOOKUP($B8,'EKC5'!$P$4:$V$48,6,FALSE)),\" \",VLOOKUP($B8,'EKC5'!$P$4:$V$48,6,FALSE))","v":" "}]
[6,{"$f":"IF(EQUIPES!G5>0,EQUIPES!A5,\"\")","v":"ERK TEAM"},28,1,{"$f":"IF(ISNA(VLOOKUP($B9,'EKC1'!$P$4:$U$48,6,FALSE)),\" \",VLOOKUP($B9,'EKC1'!$P$4:$U$48,6,FALSE))","v":28},{"$f":"IF(ISNA(VLOOKUP($B9,'EKC2'!$P$4:$V$48,6,FALSE)),\" \",VLOOKUP($B9,'EKC2'!$P$4:$V$48,6,FALSE))","v":" "},{"$f":"IF(ISNA(VLOOKUP($B9,'EKC3'!$P$4:$V$48,6,FALSE)),\" \",VLOOKUP($B9,'EKC3'!$P$4:$V$48,6,FALSE))","v":" "},{"$f":"IF(ISNA(VLOOKUP($B9,'EKC4'!$P$4:$V$48,6,FALSE)),\" \",VLOOKUP($B9,'EKC4'!$P$4:$V$48,6,FALSE))","v":" "},{"$f":"IF(ISNA(VLOOKUP($B9,'EKC5'!$P$4:$V$48,6,FALSE)),\" \",VLOOKUP($B9,'EKC5'!$P$4:$V$48,6,FALSE))","v":" "}]
[7,{"$f":"IF(EQUIPES!G7>0,EQUIPES!A7,\"\")","v":"FEEL EUROPE"},27,1,{"$f":"IF(ISNA(VLOOKUP($B10,'EKC1'!$P$4:$U$48,6,FALSE)),\" \",VLOOKUP($B10,'EKC1'!$P$4:$U$48,6,FALSE))","v":27},{"$f":"IF(ISNA(VLOOKUP($B10,'EKC2'!$P$4:$V$48,6,FALSE)),\" \",VLOOKUP($B10,'EKC2'!$P$4:$V$48,6,FALSE))","v":" "},{"$f":"IF(ISNA(VLOOKUP($B10,'EKC3'!$P$4:$V$48,6,FALSE)),\" \",VLOOKUP($B10,'EKC3'!$P$4:$V$48,6,FALSE))","v":" "},{"$f":"IF(ISNA(VLOOKUP($B10,'EKC4'!$P$4:$V$48,6,FALSE)),\" \",VLOOKUP($B10,'EKC4'!$P$4:$V$48,6,FALSE))","v":" "},{"$f":"IF(ISNA(VLOOKUP($B10,'EKC5'!$P$4:$V$48,6,FALSE)),\" \",VLOOKUP($B10,'EKC5'!$P$4:$V$48,6,FALSE))","v":" "}]
[8,{"$f":"IF(EQUIPES!G9>0,EQUIPES!A9,\"\")","v":"JM2 RACING"},26,1,{"$f":"IF(ISNA(VLOOKUP($B11,'EKC1'!$P$4:$U$48,6,FALSE)),\" \",VLOOKUP($B11,'EKC1'!$P$4:$U$48,6,FALSE))","v":26},{"$f":"IF(ISNA(VLOOKUP($B11,'EKC2'!$P$4:$V$48,6,FALSE)),\" \",VLOOKUP($B11,'EKC2'!$P$4:$V$48,6,FALSE))","v":" "},{"$f":"IF(ISNA(VLOOKUP($B11,'EKC3'!$P$4:$V$48,6,FALSE)),\" \",VLOOKUP($B11,'EKC3'!$P$4:$V$48,6,FALSE))","v":" "},{"$f":"IF(ISNA(VLOOKUP($B11,'EKC4'!$P$4:$V$48,6,FALSE)),\" \",VLOOKUP($B11,'EKC4'!$P$4:$V$48,6,FALSE))","v":" "},{"$f":"IF(ISNA(VLOOKUP($B11,'EKC5'!$P$4:$V$48,6,FALSE)),\" \",VLOOKUP($B11,'EKC5'!$P$4:$V$48,6,FALSE))","v":" "}]
[9,{"$f":"IF(EQUIPES!G18>0,EQUIPES!A18,\"\")","v":"THALES 1"},25,1,{"$f":"IF(ISNA(VLOOKUP($B12,'EKC1'!$P$4:$U$48,6,FALSE)),\" \",VLOOKUP($B12,'EKC1'!$P$4:$U$48,6,FALSE))","v":25},{"$f":"IF(ISNA(VLOOKUP($B12,'EKC2'!$P$4:$V$48,6,FALSE)),\" \",VLOOKUP($B12,'EKC2'!$P$4:$V$48,6,FALSE))","v":" "},{"$f":"IF(ISNA(VLOOKUP($B12,'EKC3'!$P$4:$V$48,6,FALSE)),\" \",VLOOKUP($B12,'EKC3'!$P$4:$V$48,6,FALSE))","v":" "},{"$f":"IF(ISNA(VLOOKUP($B12,'EKC4'!$P$4:$V$48,6,FALSE)),\" \",VLOOKUP($B12,'EKC4'!$P$4:$V$48,6,FALSE))","v":" "},{"$f":"IF(ISNA(VLOOKUP($B12,'EKC5'!$P$4:$V$48,6,FALSE)),\" \",VLOOKUP($B12,'EKC5'!$P$4:$V$48,6,FALSE))","v":" "}]
[10,{"$f":"IF(EQUIPES!G8>0,EQUIPES!A8,\"\")","v":"JDB TEAM"},24,1,{"$f":"IF(ISNA(VLOOKUP($B13,'EKC1'!$P$4:$U$48,6,FALSE)),\" \",VLOOKUP($B13,'EKC1'!$P$4:$U$48,6,FALSE))","v":24},{"$f":"IF(ISNA(VLOOKUP($B13,'EKC2'!$P$4:$V$48,6,FALSE)),\" \",VLOOKUP($B13,'EKC2'!$P$4:$V$48,6,FALSE))","v":" "},{"$f":"IF(ISNA(VLOOKUP($B13,'EKC3'!$P$4:$V$48,6,FALSE)),\" \",VLOOKUP($B13,'EKC3'!$P$4:$V$48,6,FALSE))","v":" "},{"$f":"IF(ISNA(VLOOKUP($B13,'EKC4'!$P$4:$V$48,6,FALSE)),\" \",VLOOKUP($B13,'EKC4'!$P$4:$V$48,6,FALSE))","v":" "},{"$f":"IF(ISNA(VLOOKUP($B13,'EKC5'!$P$4:$V$48,6,FALSE)),\" \",VLOOKUP($B13,'EKC5'!$P$4:$V$48,6,FALSE))","v":" "}]
[11,{"$f":"IF(EQUIPES!G12>0,EQUIPES!A12,\"\")","v":"MECAGAZ"},23,1,{"$f":"IF(ISNA(VLOOKUP($B14,'EKC1'!$P$4:$U$48,6,FALSE)),\" \",VLOOKUP($B14,'EKC1'!$P$4:$U$48,6,FALSE))","v":23},{"$f":"IF(ISNA(VLOOKUP($B14,'EKC2'!$P$4:$V$48,6,FALSE)),\" \",VLOOKUP($B14,'EKC2'!$P$4:$V$48,6,FALSE))","v":" "},{"$f":"IF(ISNA(VLOOKUP($B14,'EKC3'!$P$4:$V$48,6,FALSE)),\" \",VLOOKUP($B14,'EKC3'!$P$4:$V$48,6,FALSE))","v":" "},{"$f":"IF(ISNA(VLOOKUP($B14,'EKC4'!$P$4:$V$48,6,FALSE)),\" \",VLOOKUP($B14,'EKC4'!$P$4:$V$48,6,FALSE))","v":" "},{"$f":"IF(ISNA(VLOOKUP($B14,'EKC5'!$P$4:$V$48,6,FALSE)),\" \",VLOOKUP($B14,'EKC5'!$P$4:$V$48,6,FALSE))","v":" "}]
[12,{"$f":"IF(EQUIPES!G11>0,EQUIPES!A11,\"\")","v":"MACADAM RACING"},22,1,{"$f":"IF(ISNA(VLOOKUP($B15,'EKC1'!$P$4:$U$48,6,FALSE)),\" \",VLOOKUP($B15,'EKC1'!$P$4:$U$48,6,FALSE))","v":22},{"$f":"IF(ISNA(VLOOKUP($B15,'EKC2'!$P$4:$V$48,6,FALSE)),\" \",VLOOKUP($B15,'EKC2'!$P$4:$V$48,6,FALSE))","v":" "},{"$f":"IF(ISNA(VLOOKUP($B15,'EKC3'!$P$4:$V$48,6,FALSE)),\" \",VLOOKUP($B15,'EKC3'!$P$4:$V$48,6,FALSE))","v":" "},{"$f":"IF(ISNA(VLOOKUP($B15,'EKC4'!$P$4:$V$48,6,FALSE)),\" \",VLOOKUP($B15,'EKC4'!$P$4:$V$48,6,FALSE))","v":" "},{"$f":"IF(ISNA(VLOOKUP($B15,'EKC5'!$P$4:$V$48,6,FALSE)),\" \",VLOOKUP($B15,'EKC5'!$P$4:$V$48,6,FALSE))","v":" "}]
[13,{"$f":"IF(EQUIPES!G4>0,EQUIPES!A4,\"\")","v":"CAEN VERANDAS"},21,1,{"$f":"IF(ISNA(VLOOKUP($B16,'EKC1'!$P$4:$U$48,6,FALSE)),\" \",VLOOKUP($B16,'EKC1'!$P$4:$U$48,6,FALSE))","v":21},{"$f":"IF(ISNA(VLOOKUP($B16,'EKC2'!$P$4:$V$48,6,FALSE)),\" \",VLOOKUP($B16,'EKC2'!$P$4:$V$48,6,FALSE))","v":" "},{"$f":"IF(ISNA(VLOOKUP($B16,'EKC3'!$P$4:$V$48,6,FALSE)),\" \",VLOOKUP($B16,'EKC3'!$P$4:$V$48,6,FALSE))","v":" "},{"$f":"IF(ISNA(VLOOKUP($B16,'EKC4'!$P$4:$V$48,6,FALSE)),\" \",VLOOKUP($B16,'EKC4'!$P$4:$V$48,6,FALSE))","v":" "},{"$f":"IF(ISNA(VLOOKUP($B16,'EKC5'!$P$4:$V$48,6,FALSE)),\" \",VLOOKUP($B16,'EKC5'!$P$4:$V$48,6,FALSE))","v":" "}]
[14,{"$f":"IF(EQUIPES!G15>0,EQUIPES!A15,\"\")","v":"TEAM ENKART'ON"},20,1,{"$f":"IF(ISNA(VLOOKUP($B17,'EKC1'!$P$4:$U$48,6,FALSE)),\" \",VLOOKUP($B17,'EKC1'!$P$4:$U$48,6,FALSE))","v":20},{"$f":"IF(ISNA(VLOOKUP($B17,'EKC2'!$P$4:$V$48,6,FALSE)),\" \",VLOOKUP($B17,'EKC2'!$P$4:$V$48,6,FALSE))","v":" "},{"$f":"IF(ISNA(VLOOKUP($B17,'EKC3'!$P$4:$V$48,6,FALSE)),\" \",VLOOKUP($B17,'EKC3'!$P$4:$V$48,6,FALSE))","v":" "},{"$f":"IF(ISNA(VLOOKUP($B17,'EKC4'!$P$4:$V$48,6,FALSE)),\" \",VLOOKUP($B17,'EKC4'!$P$4:$V$48,6,FALSE))","v":" "},{"$f":"IF(ISNA(VLOOKUP($B17,'EKC5'!$P$4:$V$48,6,FALSE)),\" \",VLOOKUP($B17,'EKC5'!$P$4:$V$48,6,FALSE))","v":" "}]
[15,{"$f":"IF(EQUIPES!G16>0,EQUIPES!A16,\"\")","v":"TEAM RINHA"},19,1,{"$f":"IF(ISNA(VLOOKUP($B18,'EKC1'!$P$4:$U$48,6,FALSE)),\" \",VLOOKUP($B18,'EKC1'!$P$4:$U$48,6,FALSE))","v":19},{"$f":"IF(ISNA(VLOOKUP($B18,'EKC2'!$P$4:$V$48,6,FALSE)),\" \",VLOOKUP($B18,'EKC2'!$P$4:$V$48,6,FALSE))","v":" "},{"$f":"IF(ISNA(VLOOKUP($B18,'EKC3'!$P$4:$V$48,6,FALSE)),\" \",VLOOKUP($B18,'EKC3'!$P$4:$V$48,6,FALSE))","v":" "},{"$f":"IF(ISNA(VLOOKUP($B18,'EKC4'!$P$4:$V$48,6,FALSE)),\" \",VLOOKUP($B18,'EKC4'!$P$4:$V$48,6,FALSE))","v":" "},{"$f":"IF(ISNA(VLOOKUP($B18,'EKC5'!$P$4:$V$48,6,FALSE)),\" \",VLOOKUP($B18,'EKC5'!$P$4:$V$48,6,FALSE))","v":" "}]
[16,{"$f":"IF(EQUIPES!G14>0,EQUIPES!A14,\"\")","v":"TEAM CAIPI"},18,1,{"$f":"IF(ISNA(VLOOKUP($B19,'EKC1'!$P$4:$U$48,6,FALSE)),\" \",VLOOKUP($B19,'EKC1'!$P$4:$U$48,6,FALSE))","v":18},{"$f":"IF(ISNA(VLOOKUP($B19,'EKC2'!$P$4:$V$48,6,FALSE)),\" \",VLOOKUP($B19,'EKC2'!$P$4:$V$48,6,FALSE))","v":" "},{"$f":"IF(ISNA(VLOOKUP($B19,'EKC3'!$P$4:$V$48,6,FALSE)),\" \",VLOOKUP($B19,'EKC3'!$P$4:$V$48,6,FALSE))","v":" "},{"$f":"IF(ISNA(VLOOKUP($B19,'EKC4'!$P$4:$V$48,6,FALSE)),\" \",VLOOKUP($B19,'EKC4'!$P$4:$V$48,6,FALSE))","v":" "},{"$f":"IF(ISNA(VLOOKUP($B19,'EKC5'!$P$4:$V$48,6,FALSE)),\" \",VLOOKUP($B19,'EKC5'!$P$4:$V$48,6,FALSE))","v":" "}]
[17,{"$f":"IF(EQUIPES!G40>0,EQUIPES!A40,\"\")","v":""},0,"",{"$f":"IF(ISNA(VLOOKUP($B20,'EKC1'!$P$4:$U$48,6,FALSE)),\" \",VLOOKUP($B20,'EKC1'!$P$4:$U$48,6,FALSE))","v":" "},{"$f":"IF(ISNA(VLOOKUP($B20,'EKC2'!$P$4:$V$48,6,FALSE)),\" \",VLOOKUP($B20,'EKC2'!$P$4:$V$48,6,FALSE))","v":" "},{"$f":"IF(ISNA(VLOOKUP($B20,'EKC3'!$P$4:$V$48,6,FALSE)),\" \",VLOOKUP($B20,'EKC3'!$P$4:$V$48,6,FALSE))","v":" "},{"$f":"IF(ISNA(VLOOKUP($B20,'EKC4'!$P$4:$V$48,6,FALSE)),\" \",VLOOKUP($B20,'EKC4'!$P$4:$V$48,6,FALSE))","v":" "},{"$f":"IF(ISNA(VLOOKUP($B20,'EKC5'!$P$4:$V$48,6,FALSE)),\" \",VLOOKUP($B20,'EKC5'!$P$4:$V$48,6,FALSE))","v":" "}]
[18,{"$f":"IF(EQUIPES!G28>0,EQUIPES!A28,\"\")","v":""},0,"",{"$f":"IF(ISNA(VLOOKUP($B21,'EKC1'!$P$4:$U$48,6,FALSE)),\" \",VLOOKUP($B21,'EKC1'!$P$4:$U$48,6,FALSE))","v":" "},{"$f":"IF(ISNA(VLOOKUP($B21,'EKC2'!$P$4:$V$48,6,FALSE)),\" \",VLOOKUP($B21,'EKC2'!$P$4:$V$48,6,FALSE))","v":" "},{"$f":"IF(ISNA(VLOOKUP($B21,'EKC3'!$P$4:$V$48,6,FALSE)),\" \",VLOOKUP($B21,'EKC3'!$P$4:$V$48,6,FALSE))","v":" "},{"$f":"IF(ISNA(VLOOKUP($B21,'EKC4'!$P$4:$V$48,6,FALSE)),\" \",VLOOKUP($B21,'EKC4'!$P$4:$V$48,6,FALSE))","v":" "},{"$f":"IF(ISNA(VLOOKUP($B21,'EKC5'!$P$4:$V$48,6,FALSE)),\" \",VLOOKUP($B21,'EKC5'!$P$4:$V$48,6,FALSE))","v":" "}]
[19,{"$f":"IF(EQUIPES!G78>0,EQUIPES!A78,\"\")","v":""},0,"",{"$f":"IF(ISNA(VLOOKUP($B22,'EKC1'!$P$4:$U$48,6,FALSE)),\" \",VLOOKUP($B22,'EKC1'!$P$4:$U$48,6,FALSE))","v":" "},{"$f":"IF(ISNA(VLOOKUP($B22,'EKC2'!$P$4:$V$48,6,FALSE)),\" \",VLOOKUP($B22,'EKC2'!$P$4:$V$48,6,FALSE))","v":" "},{"$f":"IF(ISNA(VLOOKUP($B22,'EKC3'!$P$4:$V$48,6,FALSE)),\" \",VLOOKUP($B22,'EKC3'!$P$4:$V$48,6,FALSE))","v":" "},{"$f":"IF(ISNA(VLOOKUP($B22,'EKC4'!$P$4:$V$48,6,FALSE)),\" \",VLOOKUP($B22,'EKC4'!$P$4:$V$48,6,FALSE))","v":" "},{"$f":"IF(ISNA(VLOOKUP($B22,'EKC5'!$P$4:$V$48,6,FALSE)),\" \",VLOOKUP($B22,'EKC5'!$P$4:$V$48,6,FALSE))","v":" "}]
[20,{"$f":"IF(EQUIPES!G56>0,EQUIPES!A56,\"\")","v":""},0,"",{"$f":"IF(ISNA(VLOOKUP($B23,'EKC1'!$P$4:$U$48,6,FALSE)),\" \",VLOOKUP($B23,'EKC1'!$P$4:$U$48,6,FALSE))","v":" "},{"$f":"IF(ISNA(VLOOKUP($B23,'EKC2'!$P$4:$V$48,6,FALSE)),\" \",VLOOKUP($B23,'EKC2'!$P$4:$V$48,6,FALSE))","v":" "},{"$f":"IF(ISNA(VLOOKUP($B23,'EKC3'!$P$4:$V$48,6,FALSE)),\" \",VLOOKUP($B23,'EKC3'!$P$4:$V$48,6,FALSE))","v":" "},{"$f":"IF(ISNA(VLOOKUP($B23,'EKC4'!$P$4:$V$48,6,FALSE)),\" \",VLOOKUP($B23,'EKC4'!$P$4:$V$48,6,FALSE))","v":" "},{"$f":"IF(ISNA(VLOOKUP($B23,'EKC5'!$P$4:$V$48,6,FALSE)),\" \",VLOOKUP($B23,'EKC5'!$P$4:$V$48,6,FALSE))","v":" "}]
[21,{"$f":"IF(EQUIPES!G27>0,EQUIPES!A27,\"\")","v":""},0,"",{"$f":"IF(ISNA(VLOOKUP($B24,'EKC1'!$P$4:$U$48,6,FALSE)),\" \",VLOOKUP($B24,'EKC1'!$P$4:$U$48,6,FALSE))","v":" "},{"$f":"IF(ISNA(VLOOKUP($B24,'EKC2'!$P$4:$V$48,6,FALSE)),\" \",VLOOKUP($B24,'EKC2'!$P$4:$V$48,6,FALSE))","v":" "},{"$f":"IF(ISNA(VLOOKUP($B24,'EKC3'!$P$4:$V$48,6,FALSE)),\" \",VLOOKUP($B24,'EKC3'!$P$4:$V$48,6,FALSE))","v":" "},{"$f":"IF(ISNA(VLOOKUP($B24,'EKC4'!$P$4:$V$48,6,FALSE)),\" \",VLOOKUP($B24,'EKC4'!$P$4:$V$48,6,FALSE))","v":" "},{"$f":"IF(ISNA(VLOOKUP($B24,'EKC5'!$P$4:$V$48,6,FALSE)),\" \",VLOOKUP($B24,'EKC5'!$P$4:$V$48,6,FALSE))","v":" "}]
[22,{"$f":"IF(EQUIPES!G31>0,EQUIPES!A31,\"\")","v":""},0,"",{"$f":"IF(ISNA(VLOOKUP($B25,'EKC1'!$P$4:$U$48,6,FALSE)),\" \",VLOOKUP($B25,'EKC1'!$P$4:$U$48,6,FALSE))","v":" "},{"$f":"IF(ISNA(VLOOKUP($B25,'EKC2'!$P$4:$V$48,6,FALSE)),\" \",VLOOKUP($B25,'EKC2'!$P$4:$V$48,6,FALSE))","v":" "},{"$f":"IF(ISNA(VLOOKUP($B25,'EKC3'!$P$4:$V$48,6,FALSE)),\" \",VLOOKUP($B25,'EKC3'!$P$4:$V$48,6,FALSE))","v":" "},{"$f":"IF(ISNA(VLOOKUP($B25,'EKC4'!$P$4:$V$48,6,FALSE)),\" \",VLOOKUP($B25,'EKC4'!$P$4:$V$48,6,FALSE))","v":" "},{"$f":"IF(ISNA(VLOOKUP($B25,'EKC5'!$P$4:$V$48,6,FALSE)),\" \",VLOOKUP($B25,'EKC5'!$P$4:$V$48,6,FALSE))","v":" "}]
[23,{"$f":"IF(EQUIPES!G39>0,EQUIPES!A39,\"\")","v":""},0,"",{"$f":"IF(ISNA(VLOOKUP($B26,'EKC1'!$P$4:$U$48,6,FALSE)),\" \",VLOOKUP($B26,'EKC1'!$P$4:$U$48,6,FALSE))","v":" "},{"$f":"IF(ISNA(VLOOKUP($B26,'EKC2'!$P$4:$V$48,6,FALSE)),\" \",VLOOKUP($B26,'EKC2'!$P$4:$V$48,6,FALSE))","v":" "},{"$f":"IF(ISNA(VLOOKUP($B26,'EKC3'!$P$4:$V$48,6,FALSE)),\" \",VLOOKUP($B26,'EKC3'!$P$4:$V$48,6,FALSE))","v":" "},{"$f":"IF(ISNA(VLOOKUP($B26,'EKC4'!$P$4:$V$48,6,FALSE)),\" \",VLOOKUP($B26,'EKC4'!$P$4:$V$48,6,FALSE))","v":" "},{"$f":"IF(ISNA(VLOOKUP($B26,'EKC5'!$P$4:$V$48,6,FALSE)),\" \",VLOOKUP($B26,'EKC5'!$P$4:$V$48,6,FALSE))","v":" "}]
[24,{"$f":"IF(EQUIPES!G82>0,EQUIPES!A82,\"\")","v":""},0,"",{"$f":"IF(ISNA(VLOOKUP($B27,'EKC1'!$P$4:$U$48,6,FALSE)),\" \",VLOOKUP($B27,'EKC1'!$P$4:$U$48,6,FALSE))","v":" "},{"$f":"IF(ISNA(VLOOKUP($B27,'EKC2'!$P$4:$V$48,6,FALSE)),\" \",VLOOKUP($B27,'EKC2'!$P$4:$V$48,6,FALSE))","v":" "},{"$f":"IF(ISNA(VLOOKUP($B27,'EKC3'!$P$4:$V$48,6,FALSE)),\" \",VLOOKUP($B27,'EKC3'!$P$4:$V$48,6,FALSE))","v":" "},{"$f":"IF(ISNA(VLOOKUP($B27,'EKC4'!$P$4:$V$48,6,FALSE)),\" \",VLOOKUP($B27,'EKC4'!$P$4:$V$48,6,FALSE))","v":" "},{"$f":"IF(ISNA(VLOOKUP($B27,'EKC5'!$P$4:$V$48,6,FALSE)),\" \",VLOOKUP($B27,'EKC5'!$P$4:$V$48,6,FALSE))","v":" "}]
[25,{"$f":"IF(EQUIPES!G38>0,EQUIPES!A38,\"\")","v":""},0,"",{"$f":"IF(ISNA(VLOOKUP($B28,'EKC1'!$P$4:$U$48,6,FALSE)),\" \",VLOOKUP($B28,'EKC1'!$P$4:$U$48,6,FALSE))","v":" "},{"$f":"IF(ISNA(VLOOKUP($B28,'EKC2'!$P$4:$V$48,6,FALSE)),\" \",VLOOKUP($B28,'EKC2'!$P$4:$V$48,6,FALSE))","v":" "},{"$f":"IF(ISNA(VLOOKUP($B28,'EKC3'!$P$4:$V$48,6,FALSE)),\" \",VLOOKUP($B28,'EKC3'!$P$4:$V$48,6,FALSE))","v":" "},{"$f":"IF(ISNA(VLOOKUP($B28,'EKC4'!$P$4:$V$48,6,FALSE)),\" \",VLOOKUP($B28,'EKC4'!$P$4:$V$48,6,FALSE))","v":" "},{"$f":"IF(ISNA(VLOOKUP($B28,'EKC5'!$P$4:$V$48,6,FALSE)),\" \",VLOOKUP($B28,'EKC5'!$P$4:$V$48,6,FALSE))","v":" "}]
[26,{"$f":"IF(EQUIPES!G54>0,EQUIPES!A54,\"\")","v":""},0,"",{"$f":"IF(ISNA(VLOOKUP($B29,'EKC1'!$P$4:$U$48,6,FALSE)),\" \",VLOOKUP($B29,'EKC1'!$P$4:$U$48,6,FALSE))","v":" "},{"$f":"IF(ISNA(VLOOKUP($B29,'EKC2'!$P$4:$V$48,6,FALSE)),\" \",VLOOKUP($B29,'EKC2'!$P$4:$V$48,6,FALSE))","v":" "},{"$f":"IF(ISNA(VLOOKUP($B29,'EKC3'!$P$4:$V$48,6,FALSE)),\" \",VLOOKUP($B29,'EKC3'!$P$4:$V$48,6,FALSE))","v":" "},{"$f":"IF(ISNA(VLOOKUP($B29,'EKC4'!$P$4:$V$48,6,FALSE)),\" \",VLOOKUP($B29,'EKC4'!$P$4:$V$48,6,FALSE))","v":" "},{"$f":"IF(ISNA(VLOOKUP($B29,'EKC5'!$P$4:$V$48,6,FALSE)),\" \",VLOOKUP($B29,'EKC5'!$P$4:$V$48,6,FALSE))","v":" "}]
[27,{"$f":"IF(EQUIPES!G52>0,EQUIPES!A52,\"\")","v":""},0,"",{"$f":"IF(ISNA(VLOOKUP($B30,'EKC1'!$P$4:$U$48,6,FALSE)),\" \",VLOOKUP($B30,'EKC1'!$P$4:$U$48,6,FALSE))","v":" "},{"$f":"IF(ISNA(VLOOKUP($B30,'EKC2'!$P$4:$V$48,6,FALSE)),\" \",VLOOKUP($B30,'EKC2'!$P$4:$V$48,6,FALSE))","v":" "},{"$f":"IF(ISNA(VLOOKUP($B30,'EKC3'!$P$4:$V$48,6,FALSE)),\" \",VLOOKUP($B30,'EKC3'!$P$4:$V$48,6,FALSE))","v":" "},{"$f":"IF(ISNA(VLOOKUP($B30,'EKC4'!$P$4:$V$48,6,FALSE)),\" \",VLOOKUP($B30,'EKC4'!$P$4:$V$48,6,FALSE))","v":" "},{"$f":"IF(ISNA(VLOOKUP($B30,'EKC5'!$P$4:$V$48,6,FALSE)),\" \",VLOOKUP($B30,'EKC5'!$P$4:$V$48,6,FALSE))","v":" "}]
[28,{"$f":"IF(EQUIPES!G20>0,EQUIPES!A20,\"\")","v":""},0,"",{"$f":"IF(ISNA(VLOOKUP($B31,'EKC1'!$P$4:$U$48,6,FALSE)),\" \",VLOOKUP($B31,'EKC1'!$P$4:$U$48,6,FALSE))","v":" "},{"$f":"IF(ISNA(VLOOKUP($B31,'EKC2'!$P$4:$V$48,6,FALSE)),\" \",VLOOKUP($B31,'EKC2'!$P$4:$V$48,6,FALSE))","v":" "},{"$f":"IF(ISNA(VLOOKUP($B31,'EKC3'!$P$4:$V$48,6,FALSE)),\" \",VLOOKUP($B31,'EKC3'!$P$4:$V$48,6,FALSE))","v":" "},{"$f":"IF(ISNA(VLOOKUP($B31,'EKC4'!$P$4:$V$48,6,FALSE)),\" \",VLOOKUP($B31,'EKC4'!$P$4:$V$48,6,FALSE))","v":" "},{"$f":"IF(ISNA(VLOOKUP($B31,'EKC5'!$P$4:$V$48,6,FALSE)),\" \",VLOOKUP($B31,'EKC5'!$P$4:$V$48,6,FALSE))","v":" "}]
[29,{"$f":"IF(EQUIPES!G69>0,EQUIPES!A69,\"\")","v":""},0,"",{"$f":"IF(ISNA(VLOOKUP($B32,'EKC1'!$P$4:$U$48,6,FALSE)),\" \",VLOOKUP($B32,'EKC1'!$P$4:$U$48,6,FALSE))","v":" "},{"$f":"IF(ISNA(VLOOKUP($B32,'EKC2'!$P$4:$V$48,6,FALSE)),\" \",VLOOKUP($B32,'EKC2'!$P$4:$V$48,6,FALSE))","v":" "},{"$f":"IF(ISNA(VLOOKUP($B32,'EKC3'!$P$4:$V$48,6,FALSE)),\" \",VLOOKUP($B32,'EKC3'!$P$4:$V$48,6,FALSE))","v":" "},{"$f":"IF(ISNA(VLOOKUP($B32,'EKC4'!$P$4:$V$48,6,FALSE)),\" \",VLOOKUP($B32,'EKC4'!$P$4:$V$48,6,FALSE))","v":" "},{"$f":"IF(ISNA(VLOOKUP($B32,'EKC5'!$P$4:$V$48,6,FALSE)),\" \",VLOOKUP($B32,'EKC5'!$P$4:$V$48,6,FALSE))","v":" "}]
[30,{"$f":"IF(EQUIPES!G75>0,EQUIPES!A75,\"\")","v":""},0,"",{"$f":"IF(ISNA(VLOOKUP($B33,'EKC1'!$P$4:$U$48,6,FALSE)),\" \",VLOOKUP($B33,'EKC1'!$P$4:$U$48,6,FALSE))","v":" "},{"$f":"IF(ISNA(VLOOKUP($B33,'EKC2'!$P$4:$V$48,6,FALSE)),\" \",VLOOKUP($B33,'EKC2'!$P$4:$V$48,6,FALSE))","v":" "},{"$f":"IF(ISNA(VLOOKUP($B33,'EKC3'!$P$4:$V$48,6,FALSE)),\" \",VLOOKUP($B33,'EKC3'!$P$4:$V$48,6,FALSE))","v":" "},{"$f":"IF(ISNA(VLOOKUP($B33,'EKC4'!$P$4:$V$48,6,FALSE)),\" \",VLOOKUP($B33,'EKC4'!$P$4:$V$48,6,FALSE))","v":" "},{"$f":"IF(ISNA(VLOOKUP($B33,'EKC5'!$P$4:$V$48,6,FALSE)),\" \",VLOOKUP($B33,'EKC5'!$P$4:$V$48,6,FALSE))","v":" "}]
[31,{"$f":"IF(EQUIPES!G68>0,EQUIPES!A68,\"\")","v":""},0,"",{"$f":"IF(ISNA(VLOOKUP($B34,'EKC1'!$P$4:$U$48,6,FALSE)),\" \",VLOOKUP($B34,'EKC1'!$P$4:$U$48,6,FALSE))","v":" "},{"$f":"IF(ISNA(VLOOKUP($B34,'EKC2'!$P$4:$V$48,6,FALSE)),\" \",VLOOKUP($B34,'EKC2'!$P$4:$V$48,6,FALSE))","v":" "},{"$f":"IF(ISNA(VLOOKUP($B34,'EKC3'!$P$4:$V$48,6,FALSE)),\" \",VLOOKUP($B34,'EKC3'!$P$4:$V$48,6,FALSE))","v":" "},{"$f":"IF(ISNA(VLOOKUP($B34,'EKC4'!$P$4:$V$48,6,FALSE)),\" \",VLOOKUP($B34,'EKC4'!$P$4:$V$48,6,FALSE))","v":" "},{"$f":"IF(ISNA(VLOOKUP($B34,'EKC5'!$P$4:$V$48,6,FALSE)),\" \",VLOOKUP($B34,'EKC5'!$P$4:$V$48,6,FALSE))","v":" "}]
[32,{"$f":"IF(EQUIPES!G55>0,EQUIPES!A55,\"\")","v":""},0,"",{"$f":"IF(ISNA(VLOOKUP($B35,'EKC1'!$P$4:$U$48,6,FALSE)),\" \",VLOOKUP($B35,'EKC1'!$P$4:$U$48,6,FALSE))","v":" "},{"$f":"IF(ISNA(VLOOKUP($B35,'EKC2'!$P$4:$V$48,6,FALSE)),\" \",VLOOKUP($B35,'EKC2'!$P$4:$V$48,6,FALSE))","v":" "},{"$f":"IF(ISNA(VLOOKUP($B35,'EKC3'!$P$4:$V$48,6,FALSE)),\" \",VLOOKUP($B35,'EKC3'!$P$4:$V$48,6,FALSE))","v":" "},{"$f":"IF(ISNA(VLOOKUP($B35,'EKC4'!$P$4:$V$48,6,FALSE)),\" \",VLOOKUP($B35,'EKC4'!$P$4:$V$48,6,FALSE))","v":" "},{"$f":"IF(ISNA(VLOOKUP($B35,'EKC5'!$P$4:$V$48,6,FALSE)),\" \",VLOOKUP($B35,'EKC5'!$P$4:$V$48,6,FALSE))","v":" "}]
[33,{"$f":"IF(EQUIPES!G57>0,EQUIPES!A57,\"\")","v":""},{"$f":"SUM(E36:I36)","v":0},{"$f":"IF((COUNTIF(E36:I36,\">0\"))=0,\"\",COUNTIF(E36:I36,\">0\"))","v":""},{"$f":"IF(ISNA(VLOOKUP($B36,'EKC1'!$P$4:$U$48,6,FALSE)),\" \",VLOOKUP($B36,'EKC1'!$P$4:$U$48,6,FALSE))","v":" "},{"$f":"IF(ISNA(VLOOKUP($B36,'EKC2'!$P$4:$V$48,6,FALSE)),\" \",VLOOKUP($B36,'EKC2'!$P$4:$V$48,6,FALSE))","v":" "},{"$f":"IF(ISNA(VLOOKUP($B36,'EKC3'!$P$4:$V$48,6,FALSE)),\" \",VLOOKUP($B36,'EKC3'!$P$4:$V$48,6,FALSE))","v":" "},{"$f":"IF(ISNA(VLOOKUP($B36,'EKC4'!$P$4:$V$48,6,FALSE)),\" \",VLOOKUP($B36,'EKC4'!$P$4:$V$48,6,FALSE))","v":" "},{"$f":"IF(ISNA(VLOOKUP($B36,'EKC5'!$P$4:$V$48,6,FALSE)),\" \",VLOOKUP($B36,'EKC5'!$P$4:$V$48,6,FALSE))","v":" "}]
[34,{"$f":"IF(EQUIPES!G58>0,EQUIPES!A58,\"\")","v":""},0,"",{"$f":"IF(ISNA(VLOOKUP($B37,'EKC1'!$P$4:$U$48,6,FALSE)),\" \",VLOOKUP($B37,'EKC1'!$P$4:$U$48,6,FALSE))","v":" "},{"$f":"IF(ISNA(VLOOKUP($B37,'EKC2'!$P$4:$V$48,6,FALSE)),\" \",VLOOKUP($B37,'EKC2'!$P$4:$V$48,6,FALSE))","v":" "},{"$f":"IF(ISNA(VLOOKUP($B37,'EKC3'!$P$4:$V$48,6,FALSE)),\" \",VLOOKUP($B37,'EKC3'!$P$4:$V$48,6,FALSE))","v":" "},{"$f":"IF(ISNA(VLOOKUP($B37,'EKC4'!$P$4:$V$48,6,FALSE)),\" \",VLOOKUP($B37,'EKC4'!$P$4:$V$48,6,FALSE))","v":" "},{"$f":"IF(ISNA(VLOOKUP($B37,'EKC5'!$P$4:$V$48,6,FALSE)),\" \",VLOOKUP($B37,'EKC5'!$P$4:$V$48,6,FALSE))","v":" "}]
[35,{"$f":"IF(EQUIPES!G59>0,EQUIPES!A59,\"\")","v":""},0,"",{"$f":"IF(ISNA(VLOOKUP($B38,'EKC1'!$P$4:$U$48,6,FALSE)),\" \",VLOOKUP($B38,'EKC1'!$P$4:$U$48,6,FALSE))","v":" "},{"$f":"IF(ISNA(VLOOKUP($B38,'EKC2'!$P$4:$V$48,6,FALSE)),\" \",VLOOKUP($B38,'EKC2'!$P$4:$V$48,6,FALSE))","v":" "},{"$f":"IF(ISNA(VLOOKUP($B38,'EKC3'!$P$4:$V$48,6,FALSE)),\" \",VLOOKUP($B38,'EKC3'!$P$4:$V$48,6,FALSE))","v":" "},{"$f":"IF(ISNA(VLOOKUP($B38,'EKC4'!$P$4:$V$48,6,FALSE)),\" \",VLOOKUP($B38,'EKC4'!$P$4:$V$48,6,FALSE))","v":" "},{"$f":"IF(ISNA(VLOOKUP($B38,'EKC5'!$P$4:$V$48,6,FALSE)),\" \",VLOOKUP($B38,'EKC5'!$P$4:$V$48,6,FALSE))","v":" "}]
[36,{"$f":"IF(EQUIPES!G53>0,EQUIPES!A53,\"\")","v":""},0,"",{"$f":"IF(ISNA(VLOOKUP($B39,'EKC1'!$P$4:$U$48,6,FALSE)),\" \",VLOOKUP($B39,'EKC1'!$P$4:$U$48,6,FALSE))","v":" "},{"$f":"IF(ISNA(VLOOKUP($B39,'EKC2'!$P$4:$V$48,6,FALSE)),\" \",VLOOKUP($B39,'EKC2'!$P$4:$V$48,6,FALSE))","v":" "},{"$f":"IF(ISNA(VLOOKUP($B39,'EKC3'!$P$4:$V$48,6,FALSE)),\" \",VLOOKUP($B39,'EKC3'!$P$4:$V$48,6,FALSE))","v":" "},{"$f":"IF(ISNA(VLOOKUP($B39,'EKC4'!$P$4:$V$48,6,FALSE)),\" \",VLOOKUP($B39,'EKC4'!$P$4:$V$48,6,FALSE))","v":" "},{"$f":"IF(ISNA(VLOOKUP($B39,'EKC5'!$P$4:$V$48,6,FALSE)),\" \",VLOOKUP($B39,'EKC5'!$P$4:$V$48,6,FALSE))","v":" "}]
[37,{"$f":"IF(EQUIPES!G60>0,EQUIPES!A60,\"\")","v":""},0,"",{"$f":"IF(ISNA(VLOOKUP($B40,'EKC1'!$P$4:$U$48,6,FALSE)),\" \",VLOOKUP($B40,'EKC1'!$P$4:$U$48,6,FALSE))","v":" "},{"$f":"IF(ISNA(VLOOKUP($B40,'EKC2'!$P$4:$V$48,6,FALSE)),\" \",VLOOKUP($B40,'EKC2'!$P$4:$V$48,6,FALSE))","v":" "},{"$f":"IF(ISNA(VLOOKUP($B40,'EKC3'!$P$4:$V$48,6,FALSE)),\" \",VLOOKUP($B40,'EKC3'!$P$4:$V$48,6,FALSE))","v":" "},{"$f":"IF(ISNA(VLOOKUP($B40,'EKC4'!$P$4:$V$48,6,FALSE)),\" \",VLOOKUP($B40,'EKC4'!$P$4:$V$48,6,FALSE))","v":" "},{"$f":"IF(ISNA(VLOOKUP($B40,'EKC5'!$P$4:$V$48,6,FALSE)),\" \",VLOOKUP($B40,'EKC5'!$P$4:$V$48,6,FALSE))","v":" "}]
[38,{"$f":"IF(EQUIPES!G61>0,EQUIPES!A61,\"\")","v":""},0,"",{"$f":"IF(ISNA(VLOOKUP($B41,'EKC1'!$P$4:$U$48,6,FALSE)),\" \",VLOOKUP($B41,'EKC1'!$P$4:$U$48,6,FALSE))","v":" "},{"$f":"IF(ISNA(VLOOKUP($B41,'EKC2'!$P$4:$V$48,6,FALSE)),\" \",VLOOKUP($B41,'EKC2'!$P$4:$V$48,6,FALSE))","v":" "},{"$f":"IF(ISNA(VLOOKUP($B41,'EKC3'!$P$4:$V$48,6,FALSE)),\" \",VLOOKUP($B41,'EKC3'!$P$4:$V$48,6,FALSE))","v":" "},{"$f":"IF(ISNA(VLOOKUP($B41,'EKC4'!$P$4:$V$48,6,FALSE)),\" \",VLOOKUP($B41,'EKC4'!$P$4:$V$48,6,FALSE))","v":" "},{"$f":"IF(ISNA(VLOOKUP($B41,'EKC5'!$P$4:$V$48,6,FALSE)),\" \",VLOOKUP($B41,'EKC5'!$P$4:$V$48,6,FALSE))","v":" "}]
[39,{"$f":"IF(EQUIPES!G62>0,EQUIPES!A62,\"\")","v":""},0,"",{"$f":"IF(ISNA(VLOOKUP($B42,'EKC1'!$P$4:$U$48,6,FALSE)),\" \",VLOOKUP($B42,'EKC1'!$P$4:$U$48,6,FALSE))","v":" "},{"$f":"IF(ISNA(VLOOKUP($B42,'EKC2'!$P$4:$V$48,6,FALSE)),\" \",VLOOKUP($B42,'EKC2'!$P$4:$V$48,6,FALSE))","v":" "},{"$f":"IF(ISNA(VLOOKUP($B42,'EKC3'!$P$4:$V$48,6,FALSE)),\" \",VLOOKUP($B42,'EKC3'!$P$4:$V$48,6,FALSE))","v":" "},{"$f":"IF(ISNA(VLOOKUP($B42,'EKC4'!$P$4:$V$48,6,FALSE)),\" \",VLOOKUP($B42,'EKC4'!$P$4:$V$48,6,FALSE))","v":" "},{"$f":"IF(ISNA(VLOOKUP($B42,'EKC5'!$P$4:$V$48,6,FALSE)),\" \",VLOOKUP($B42,'EKC5'!$P$4:$V$48,6,FALSE))","v":" "}]
[40,{"$f":"IF(EQUIPES!G63>0,EQUIPES!A63,\"\")","v":""},0,"",{"$f":"IF(ISNA(VLOOKUP($B43,'EKC1'!$P$4:$U$48,6,FALSE)),\" \",VLOOKUP($B43,'EKC1'!$P$4:$U$48,6,FALSE))","v":" "},{"$f":"IF(ISNA(VLOOKUP($B43,'EKC2'!$P$4:$V$48,6,FALSE)),\" \",VLOOKUP($B43,'EKC2'!$P$4:$V$48,6,FALSE))","v":" "},{"$f":"IF(ISNA(VLOOKUP($B43,'EKC3'!$P$4:$V$48,6,FALSE)),\" \",VLOOKUP($B43,'EKC3'!$P$4:$V$48,6,FALSE))","v":" "},{"$f":"IF(ISNA(VLOOKUP($B43,'EKC4'!$P$4:$V$48,6,FALSE)),\" \",VLOOKUP($B43,'EKC4'!$P$4:$V$48,6,FALSE))","v":" "},{"$f":"IF(ISNA(VLOOKUP($B43,'EKC5'!$P$4:$V$48,6,FALSE)),\" \",VLOOKUP($B43,'EKC5'!$P$4:$V$48,6,FALSE))","v":" "}]
[41,{"$f":"IF(EQUIPES!G64>0,EQUIPES!A64,\"\")","v":""},0,"",{"$f":"IF(ISNA(VLOOKUP($B44,'EKC1'!$P$4:$U$48,6,FALSE)),\" \",VLOOKUP($B44,'EKC1'!$P$4:$U$48,6,FALSE))","v":" "},{"$f":"IF(ISNA(VLOOKUP($B44,'EKC2'!$P$4:$V$48,6,FALSE)),\" \",VLOOKUP($B44,'EKC2'!$P$4:$V$48,6,FALSE))","v":" "},{"$f":"IF(ISNA(VLOOKUP($B44,'EKC3'!$P$4:$V$48,6,FALSE)),\" \",VLOOKUP($B44,'EKC3'!$P$4:$V$48,6,FALSE))","v":" "},{"$f":"IF(ISNA(VLOOKUP($B44,'EKC4'!$P$4:$V$48,6,FALSE)),\" \",VLOOKUP($B44,'EKC4'!$P$4:$V$48,6,FALSE))","v":" "},{"$f":"IF(ISNA(VLOOKUP($B44,'EKC5'!$P$4:$V$48,6,FALSE)),\" \",VLOOKUP($B44,'EKC5'!$P$4:$V$48,6,FALSE))","v":" "}]
[42,{"$f":"IF(EQUIPES!G65>0,EQUIPES!A65,\"\")","v":""},0,"",{"$f":"IF(ISNA(VLOOKUP($B45,'EKC1'!$P$4:$U$48,6,FALSE)),\" \",VLOOKUP($B45,'EKC1'!$P$4:$U$48,6,FALSE))","v":" "},{"$f":"IF(ISNA(VLOOKUP($B45,'EKC2'!$P$4:$V$48,6,FALSE)),\" \",VLOOKUP($B45,'EKC2'!$P$4:$V$48,6,FALSE))","v":" "},{"$f":"IF(ISNA(VLOOKUP($B45,'EKC3'!$P$4:$V$48,6,FALSE)),\" \",VLOOKUP($B45,'EKC3'!$P$4:$V$48,6,FALSE))","v":" "},{"$f":"IF(ISNA(VLOOKUP($B45,'EKC4'!$P$4:$V$48,6,FALSE)),\" \",VLOOKUP($B45,'EKC4'!$P$4:$V$48,6,FALSE))","v":" "},{"$f":"IF(ISNA(VLOOKUP($B45,'EKC5'!$P$4:$V$48,6,FALSE)),\" \",VLOOKUP($B45,'EKC5'!$P$4:$V$48,6,FALSE))","v":" "}]
[43,{"$f":"IF(EQUIPES!G66>0,EQUIPES!A66,\"\")","v":""},0,"",{"$f":"IF(ISNA(VLOOKUP($B46,'EKC1'!$P$4:$U$48,6,FALSE)),\" \",VLOOKUP($B46,'EKC1'!$P$4:$U$48,6,FALSE))","v":" "},{"$f":"IF(ISNA(VLOOKUP($B46,'EKC2'!$P$4:$V$48,6,FALSE)),\" \",VLOOKUP($B46,'EKC2'!$P$4:$V$48,6,FALSE))","v":" "},{"$f":"IF(ISNA(VLOOKUP($B46,'EKC3'!$P$4:$V$48,6,FALSE)),\" \",VLOOKUP($B46,'EKC3'!$P$4:$V$48,6,FALSE))","v":" "},{"$f":"IF(ISNA(VLOOKUP($B46,'EKC4'!$P$4:$V$48,6,FALSE)),\" \",VLOOKUP($B46,'EKC4'!$P$4:$V$48,6,FALSE))","v":" "},{"$f":"IF(ISNA(VLOOKUP($B46,'EKC5'!$P$4:$V$48,6,FALSE)),\" \",VLOOKUP($B46,'EKC5'!$P$4:$V$48,6,FALSE))","v":" "}]
[44,{"$f":"IF(EQUIPES!G67>0,EQUIPES!A67,\"\")","v":""},0,"",{"$f":"IF(ISNA(VLOOKUP($B47,'EKC1'!$P$4:$U$48,6,FALSE)),\" \",VLOOKUP($B47,'EKC1'!$P$4:$U$48,6,FALSE))","v":" "},{"$f":"IF(ISNA(VLOOKUP($B47,'EKC2'!$P$4:$V$48,6,FALSE)),\" \",VLOOKUP($B47,'EKC2'!$P$4:$V$48,6,FALSE))","v":" "},{"$f":"IF(ISNA(VLOOKUP($B47,'EKC3'!$P$4:$V$48,6,FALSE)),\" \",VLOOKUP($B47,'EKC3'!$P$4:$V$48,6,FALSE))","v":" "},{"$f":"IF(ISNA(VLOOKUP($B47,'EKC4'!$P$4:$V$48,6,FALSE)),\" \",VLOOKUP($B47,'EKC4'!$P$4:$V$48,6,FALSE))","v":" "},{"$f":"IF(ISNA(VLOOKUP($B47,'EKC5'!$P$4:$V$48,6,FALSE)),\" \",VLOOKUP($B47,'EKC5'!$P$4:$V$48,6,FALSE))","v":" "}]
[45,{"$f":"IF(EQUIPES!G32>0,EQUIPES!A32,\"\")","v":""},0,"",{"$f":"IF(ISNA(VLOOKUP($B48,'EKC1'!$P$4:$U$48,6,FALSE)),\" \",VLOOKUP($B48,'EKC1'!$P$4:$U$48,6,FALSE))","v":" "},{"$f":"IF(ISNA(VLOOKUP($B48,'EKC2'!$P$4:$V$48,6,FALSE)),\" \",VLOOKUP($B48,'EKC2'!$P$4:$V$48,6,FALSE))","v":" "},{"$f":"IF(ISNA(VLOOKUP($B48,'EKC3'!$P$4:$V$48,6,FALSE)),\" \",VLOOKUP($B48,'EKC3'!$P$4:$V$48,6,FALSE))","v":" "},{"$f":"IF(ISNA(VLOOKUP($B48,'EKC4'!$P$4:$V$48,6,FALSE)),\" \",VLOOKUP($B48,'EKC4'!$P$4:$V$48,6,FALSE))","v":" "},{"$f":"IF(ISNA(VLOOKUP($B48,'EKC5'!$P$4:$V$48,6,FALSE)),\" \",VLOOKUP($B48,'EKC5'!$P$4:$V$48,6,FALSE))","v":" "}]
[46,{"$f":"IF(EQUIPES!G19>0,EQUIPES!A19,\"\")","v":""},0,"",{"$f":"IF(ISNA(VLOOKUP($B49,'EKC1'!$P$4:$U$48,6,FALSE)),\" \",VLOOKUP($B49,'EKC1'!$P$4:$U$48,6,FALSE))","v":" "},{"$f":"IF(ISNA(VLOOKUP($B49,'EKC2'!$P$4:$V$48,6,FALSE)),\" \",VLOOKUP($B49,'EKC2'!$P$4:$V$48,6,FALSE))","v":" "},{"$f":"IF(ISNA(VLOOKUP($B49,'EKC3'!$P$4:$V$48,6,FALSE)),\" \",VLOOKUP($B49,'EKC3'!$P$4:$V$48,6,FALSE))","v":" "},{"$f":"IF(ISNA(VLOOKUP($B49,'EKC4'!$P$4:$V$48,6,FALSE)),\" \",VLOOKUP($B49,'EKC4'!$P$4:$V$48,6,FALSE))","v":" "},{"$f":"IF(ISNA(VLOOKUP($B49,'EKC5'!$P$4:$V$48,6,FALSE)),\" \",VLOOKUP($B49,'EKC5'!$P$4:$V$48,6,FALSE))","v":" "}]
[47,{"$f":"IF(EQUIPES!G21>0,EQUIPES!A21,\"\")","v":""},0,"",{"$f":"IF(ISNA(VLOOKUP($B50,'EKC1'!$P$4:$U$48,6,FALSE)),\" \",VLOOKUP($B50,'EKC1'!$P$4:$U$48,6,FALSE))","v":" "},{"$f":"IF(ISNA(VLOOKUP($B50,'EKC2'!$P$4:$V$48,6,FALSE)),\" \",VLOOKUP($B50,'EKC2'!$P$4:$V$48,6,FALSE))","v":" "},{"$f":"IF(ISNA(VLOOKUP($B50,'EKC3'!$P$4:$V$48,6,FALSE)),\" \",VLOOKUP($B50,'EKC3'!$P$4:$V$48,6,FALSE))","v":" "},{"$f":"IF(ISNA(VLOOKUP($B50,'EKC4'!$P$4:$V$48,6,FALSE)),\" \",VLOOKUP($B50,'EKC4'!$P$4:$V$48,6,FALSE))","v":" "},{"$f":"IF(ISNA(VLOOKUP($B50,'EKC5'!$P$4:$V$48,6,FALSE)),\" \",VLOOKUP($B50,'EKC5'!$P$4:$V$48,6,FALSE))","v":" "}]
[48,{"$f":"IF(EQUIPES!G22>0,EQUIPES!A22,\"\")","v":""},0,"",{"$f":"IF(ISNA(VLOOKUP($B51,'EKC1'!$P$4:$U$48,6,FALSE)),\" \",VLOOKUP($B51,'EKC1'!$P$4:$U$48,6,FALSE))","v":" "},{"$f":"IF(ISNA(VLOOKUP($B51,'EKC2'!$P$4:$V$48,6,FALSE)),\" \",VLOOKUP($B51,'EKC2'!$P$4:$V$48,6,FALSE))","v":" "},{"$f":"IF(ISNA(VLOOKUP($B51,'EKC3'!$P$4:$V$48,6,FALSE)),\" \",VLOOKUP($B51,'EKC3'!$P$4:$V$48,6,FALSE))","v":" "},{"$f":"IF(ISNA(VLOOKUP($B51,'EKC4'!$P$4:$V$48,6,FALSE)),\" \",VLOOKUP($B51,'EKC4'!$P$4:$V$48,6,FALSE))","v":" "},{"$f":"IF(ISNA(VLOOKUP($B51,'EKC5'!$P$4:$V$48,6,FALSE)),\" \",VLOOKUP($B51,'EKC5'!$P$4:$V$48,6,FALSE))","v":" "}]
[49,{"$f":"IF(EQUIPES!G23>0,EQUIPES!A23,\"\")","v":""},0,"",{"$f":"IF(ISNA(VLOOKUP($B52,'EKC1'!$P$4:$U$48,6,FALSE)),\" \",VLOOKUP($B52,'EKC1'!$P$4:$U$48,6,FALSE))","v":" "},{"$f":"IF(ISNA(VLOOKUP($B52,'EKC2'!$P$4:$V$48,6,FALSE)),\" \",VLOOKUP($B52,'EKC2'!$P$4:$V$48,6,FALSE))","v":" "},{"$f":"IF(ISNA(VLOOKUP($B52,'EKC3'!$P$4:$V$48,6,FALSE)),\" \",VLOOKUP($B52,'EKC3'!$P$4:$V$48,6,FALSE))","v":" "},{"$f":"IF(ISNA(VLOOKUP($B52,'EKC4'!$P$4:$V$48,6,FALSE)),\" \",VLOOKUP($B52,'EKC4'!$P$4:$V$48,6,FALSE))","v":" "},{"$f":"IF(ISNA(VLOOKUP($B52,'EKC5'!$P$4:$V$48,6,FALSE)),\" \",VLOOKUP($B52,'EKC5'!$P$4:$V$48,6,FALSE))","v":" "}]
[50,{"$f":"IF(EQUIPES!G24>0,EQUIPES!A24,\"\")","v":""},0,"",{"$f":"IF(ISNA(VLOOKUP($B53,'EKC1'!$P$4:$U$48,6,FALSE)),\" \",VLOOKUP($B53,'EKC1'!$P$4:$U$48,6,FALSE))","v":" "},{"$f":"IF(ISNA(VLOOKUP($B53,'EKC2'!$P$4:$V$48,6,FALSE)),\" \",VLOOKUP($B53,'EKC2'!$P$4:$V$48,6,FALSE))","v":" "},{"$f":"IF(ISNA(VLOOKUP($B53,'EKC3'!$P$4:$V$48,6,FALSE)),\" \",VLOOKUP($B53,'EKC3'!$P$4:$V$48,6,FALSE))","v":" "},{"$f":"IF(ISNA(VLOOKUP($B53,'EKC4'!$P$4:$V$48,6,FALSE)),\" \",VLOOKUP($B53,'EKC4'!$P$4:$V$48,6,FALSE))","v":" "},{"$f":"IF(ISNA(VLOOKUP($B53,'EKC5'!$P$4:$V$48,6,FALSE)),\" \",VLOOKUP($B53,'EKC5'!$P$4:$V$48,6,FALSE))","v":" "}]
[51,{"$f":"IF(EQUIPES!G25>0,EQUIPES!A25,\"\")","v":""},0,"",{"$f":"IF(ISNA(VLOOKUP($B54,'EKC1'!$P$4:$U$48,6,FALSE)),\" \",VLOOKUP($B54,'EKC1'!$P$4:$U$48,6,FALSE))","v":" "},{"$f":"IF(ISNA(VLOOKUP($B54,'EKC2'!$P$4:$V$48,6,FALSE)),\" \",VLOOKUP($B54,'EKC2'!$P$4:$V$48,6,FALSE))","v":" "},{"$f":"IF(ISNA(VLOOKUP($B54,'EKC3'!$P$4:$V$48,6,FALSE)),\" \",VLOOKUP($B54,'EKC3'!$P$4:$V$48,6,FALSE))","v":" "},{"$f":"IF(ISNA(VLOOKUP($B54,'EKC4'!$P$4:$V$48,6,FALSE)),\" \",VLOOKUP($B54,'EKC4'!$P$4:$V$48,6,FALSE))","v":" "},{"$f":"IF(ISNA(VLOOKUP($B54,'EKC5'!$P$4:$V$48,6,FALSE)),\" \",VLOOKUP($B54,'EKC5'!$P$4:$V$48,6,FALSE))","v":" "}]
[52,{"$f":"IF(EQUIPES!G26>0,EQUIPES!A26,\"\")","v":""},0,"",{"$f":"IF(ISNA(VLOOKUP($B55,'EKC1'!$P$4:$U$48,6,FALSE)),\" \",VLOOKUP($B55,'EKC1'!$P$4:$U$48,6,FALSE))","v":" "},{"$f":"IF(ISNA(VLOOKUP($B55,'EKC2'!$P$4:$V$48,6,FALSE)),\" \",VLOOKUP($B55,'EKC2'!$P$4:$V$48,6,FALSE))","v":" "},{"$f":"IF(ISNA(VLOOKUP($B55,'EKC3'!$P$4:$V$48,6,FALSE)),\" \",VLOOKUP($B55,'EKC3'!$P$4:$V$48,6,FALSE))","v":" "},{"$f":"IF(ISNA(VLOOKUP($B55,'EKC4'!$P$4:$V$48,6,FALSE)),\" \",VLOOKUP($B55,'EKC4'!$P$4:$V$48,6,FALSE))","v":" "},{"$f":"IF(ISNA(VLOOKUP($B55,'EKC5'!$P$4:$V$48,6,FALSE)),\" \",VLOOKUP($B55,'EKC5'!$P$4:$V$48,6,FALSE))","v":" "}]
[53,{"$f":"IF(EQUIPES!G29>0,EQUIPES!A29,\"\")","v":""},0,"",{"$f":"IF(ISNA(VLOOKUP($B56,'EKC1'!$P$4:$U$48,6,FALSE)),\" \",VLOOKUP($B56,'EKC1'!$P$4:$U$48,6,FALSE))","v":" "},{"$f":"IF(ISNA(VLOOKUP($B56,'EKC2'!$P$4:$V$48,6,FALSE)),\" \",VLOOKUP($B56,'EKC2'!$P$4:$V$48,6,FALSE))","v":" "},{"$f":"IF(ISNA(VLOOKUP($B56,'EKC3'!$P$4:$V$48,6,FALSE)),\" \",VLOOKUP($B56,'EKC3'!$P$4:$V$48,6,FALSE))","v":" "},{"$f":"IF(ISNA(VLOOKUP($B56,'EKC4'!$P$4:$V$48,6,FALSE)),\" \",VLOOKUP($B56,'EKC4'!$P$4:$V$48,6,FALSE))","v":" "},{"$f":"IF(ISNA(VLOOKUP($B56,'EKC5'!$P$4:$V$48,6,FALSE)),\" \",VLOOKUP($B56,'EKC5'!$P$4:$V$48,6,FALSE))","v":" "}]
[54,{"$f":"IF(EQUIPES!G30>0,EQUIPES!A30,\"\")","v":""},0,"",{"$f":"IF(ISNA(VLOOKUP($B57,'EKC1'!$P$4:$U$48,6,FALSE)),\" \",VLOOKUP($B57,'EKC1'!$P$4:$U$48,6,FALSE))","v":" "},{"$f":"IF(ISNA(VLOOKUP($B57,'EKC2'!$P$4:$V$48,6,FALSE)),\" \",VLOOKUP($B57,'EKC2'!$P$4:$V$48,6,FALSE))","v":" "},{"$f":"IF(ISNA(VLOOKUP($B57,'EKC3'!$P$4:$V$48,6,FALSE)),\" \",VLOOKUP($B57,'EKC3'!$P$4:$V$48,6,FALSE))","v":" "},{"$f":"IF(ISNA(VLOOKUP($B57,'EKC4'!$P$4:$V$48,6,FALSE)),\" \",VLOOKUP($B57,'EKC4'!$P$4:$V$48,6,FALSE))","v":" "},{"$f":"IF(ISNA(VLOOKUP($B57,'EKC5'!$P$4:$V$48,6,FALSE)),\" \",VLOOKUP($B57,'EKC5'!$P$4:$V$48,6,FALSE))","v":" "}]
[55,{"$f":"IF(EQUIPES!G33>0,EQUIPES!A33,\"\")","v":""},0,"",{"$f":"IF(ISNA(VLOOKUP($B58,'EKC1'!$P$4:$U$48,6,FALSE)),\" \",VLOOKUP($B58,'EKC1'!$P$4:$U$48,6,FALSE))","v":" "},{"$f":"IF(ISNA(VLOOKUP($B58,'EKC2'!$P$4:$V$48,6,FALSE)),\" \",VLOOKUP($B58,'EKC2'!$P$4:$V$48,6,FALSE))","v":" "},{"$f":"IF(ISNA(VLOOKUP($B58,'EKC3'!$P$4:$V$48,6,FALSE)),\" \",VLOOKUP($B58,'EKC3'!$P$4:$V$48,6,FALSE))","v":" "},{"$f":"IF(ISNA(VLOOKUP($B58,'EKC4'!$P$4:$V$48,6,FALSE)),\" \",VLOOKUP($B58,'EKC4'!$P$4:$V$48,6,FALSE))","v":" "},{"$f":"IF(ISNA(VLOOKUP($B58,'EKC5'!$P$4:$V$48,6,FALSE)),\" \",VLOOKUP($B58,'EKC5'!$P$4:$V$48,6,FALSE))","v":" "}]
[56,{"$f":"IF(EQUIPES!G34>0,EQUIPES!A34,\"\")","v":""},0,"",{"$f":"IF(ISNA(VLOOKUP($B59,'EKC1'!$P$4:$U$48,6,FALSE)),\" \",VLOOKUP($B59,'EKC1'!$P$4:$U$48,6,FALSE))","v":" "},{"$f":"IF(ISNA(VLOOKUP($B59,'EKC2'!$P$4:$V$48,6,FALSE)),\" \",VLOOKUP($B59,'EKC2'!$P$4:$V$48,6,FALSE))","v":" "},{"$f":"IF(ISNA(VLOOKUP($B59,'EKC3'!$P$4:$V$48,6,FALSE)),\" \",VLOOKUP($B59,'EKC3'!$P$4:$V$48,6,FALSE))","v":" "},{"$f":"IF(ISNA(VLOOKUP($B59,'EKC4'!$P$4:$V$48,6,FALSE)),\" \",VLOOKUP($B59,'EKC4'!$P$4:$V$48,6,FALSE))","v":" "},{"$f":"IF(ISNA(VLOOKUP($B59,'EKC5'!$P$4:$V$48,6,FALSE)),\" \",VLOOKUP($B59,'EKC5'!$P$4:$V$48,6,FALSE))","v":" "}]
[57,{"$f":"IF(EQUIPES!G35>0,EQUIPES!A35,\"\")","v":""},0,"",{"$f":"IF(ISNA(VLOOKUP($B60,'EKC1'!$P$4:$U$48,6,FALSE)),\" \",VLOOKUP($B60,'EKC1'!$P$4:$U$48,6,FALSE))","v":" "},{"$f":"IF(ISNA(VLOOKUP($B60,'EKC2'!$P$4:$V$48,6,FALSE)),\" \",VLOOKUP($B60,'EKC2'!$P$4:$V$48,6,FALSE))","v":" "},{"$f":"IF(ISNA(VLOOKUP($B60,'EKC3'!$P$4:$V$48,6,FALSE)),\" \",VLOOKUP($B60,'EKC3'!$P$4:$V$48,6,FALSE))","v":" "},{"$f":"IF(ISNA(VLOOKUP($B60,'EKC4'!$P$4:$V$48,6,FALSE)),\" \",VLOOKUP($B60,'EKC4'!$P$4:$V$48,6,FALSE))","v":" "},{"$f":"IF(ISNA(VLOOKUP($B60,'EKC5'!$P$4:$V$48,6,FALSE)),\" \",VLOOKUP($B60,'EKC5'!$P$4:$V$48,6,FALSE))","v":" "}]
[58,{"$f":"IF(EQUIPES!G36>0,EQUIPES!A36,\"\")","v":""},0,"",{"$f":"IF(ISNA(VLOOKUP($B61,'EKC1'!$P$4:$U$48,6,FALSE)),\" \",VLOOKUP($B61,'EKC1'!$P$4:$U$48,6,FALSE))","v":" "},{"$f":"IF(ISNA(VLOOKUP($B61,'EKC2'!$P$4:$V$48,6,FALSE)),\" \",VLOOKUP($B61,'EKC2'!$P$4:$V$48,6,FALSE))","v":" "},{"$f":"IF(ISNA(VLOOKUP($B61,'EKC3'!$P$4:$V$48,6,FALSE)),\" \",VLOOKUP($B61,'EKC3'!$P$4:$V$48,6,FALSE))","v":" "},{"$f":"IF(ISNA(VLOOKUP($B61,'EKC4'!$P$4:$V$48,6,FALSE)),\" \",VLOOKUP($B61,'EKC4'!$P$4:$V$48,6,FALSE))","v":" "},{"$f":"IF(ISNA(VLOOKUP($B61,'EKC5'!$P$4:$V$48,6,FALSE)),\" \",VLOOKUP($B61,'EKC5'!$P$4:$V$48,6,FALSE))","v":" "}]
[59,{"$f":"IF(EQUIPES!G37>0,EQUIPES!A37,\"\")","v":""},0,"",{"$f":"IF(ISNA(VLOOKUP($B62,'EKC1'!$P$4:$U$48,6,FALSE)),\" \",VLOOKUP($B62,'EKC1'!$P$4:$U$48,6,FALSE))","v":" "},{"$f":"IF(ISNA(VLOOKUP($B62,'EKC2'!$P$4:$V$48,6,FALSE)),\" \",VLOOKUP($B62,'EKC2'!$P$4:$V$48,6,FALSE))","v":" "},{"$f":"IF(ISNA(VLOOKUP($B62,'EKC3'!$P$4:$V$48,6,FALSE)),\" \",VLOOKUP($B62,'EKC3'!$P$4:$V$48,6,FALSE))","v":" "},{"$f":"IF(ISNA(VLOOKUP($B62,'EKC4'!$P$4:$V$48,6,FALSE)),\" \",VLOOKUP($B62,'EKC4'!$P$4:$V$48,6,FALSE))","v":" "},{"$f":"IF(ISNA(VLOOKUP($B62,'EKC5'!$P$4:$V$48,6,FALSE)),\" \",VLOOKUP($B62,'EKC5'!$P$4:$V$48,6,FALSE))","v":" "}]
[60,{"$f":"IF(EQUIPES!G41>0,EQUIPES!A41,\"\")","v":""},0,"",{"$f":"IF(ISNA(VLOOKUP($B63,'EKC1'!$P$4:$U$48,6,FALSE)),\" \",VLOOKUP($B63,'EKC1'!$P$4:$U$48,6,FALSE))","v":" "},{"$f":"IF(ISNA(VLOOKUP($B63,'EKC2'!$P$4:$V$48,6,FALSE)),\" \",VLOOKUP($B63,'EKC2'!$P$4:$V$48,6,FALSE))","v":" "},{"$f":"IF(ISNA(VLOOKUP($B63,'EKC3'!$P$4:$V$48,6,FALSE)),\" \",VLOOKUP($B63,'EKC3'!$P$4:$V$48,6,FALSE))","v":" "},{"$f":"IF(ISNA(VLOOKUP($B63,'EKC4'!$P$4:$V$48,6,FALSE)),\" \",VLOOKUP($B63,'EKC4'!$P$4:$V$48,6,FALSE))","v":" "},{"$f":"IF(ISNA(VLOOKUP($B63,'EKC5'!$P$4:$V$48,6,FALSE)),\" \",VLOOKUP($B63,'EKC5'!$P$4:$V$48,6,FALSE))","v":" "}]
[61,{"$f":"IF(EQUIPES!G42>0,EQUIPES!A42,\"\")","v":""},0,"",{"$f":"IF(ISNA(VLOOKUP($B64,'EKC1'!$P$4:$U$48,6,FALSE)),\" \",VLOOKUP($B64,'EKC1'!$P$4:$U$48,6,FALSE))","v":" "},{"$f":"IF(ISNA(VLOOKUP($B64,'EKC2'!$P$4:$V$48,6,FALSE)),\" \",VLOOKUP($B64,'EKC2'!$P$4:$V$48,6,FALSE))","v":" "},{"$f":"IF(ISNA(VLOOKUP($B64,'EKC3'!$P$4:$V$48,6,FALSE)),\" \",VLOOKUP($B64,'EKC3'!$P$4:$V$48,6,FALSE))","v":" "},{"$f":"IF(ISNA(VLOOKUP($B64,'EKC4'!$P$4:$V$48,6,FALSE)),\" \",VLOOKUP($B64,'EKC4'!$P$4:$V$48,6,FALSE))","v":" "},{"$f":"IF(ISNA(VLOOKUP($B64,'EKC5'!$P$4:$V$48,6,FALSE)),\" \",VLOOKUP($B64,'EKC5'!$P$4:$V$48,6,FALSE))","v":" "}]
[62,{"$f":"IF(EQUIPES!G43>0,EQUIPES!A43,\"\")","v":""},0,"",{"$f":"IF(ISNA(VLOOKUP($B65,'EKC1'!$P$4:$U$48,6,FALSE)),\" \",VLOOKUP($B65,'EKC1'!$P$4:$U$48,6,FALSE))","v":" "},{"$f":"IF(ISNA(VLOOKUP($B65,'EKC2'!$P$4:$V$48,6,FALSE)),\" \",VLOOKUP($B65,'EKC2'!$P$4:$V$48,6,FALSE))","v":" "},{"$f":"IF(ISNA(VLOOKUP($B65,'EKC3'!$P$4:$V$48,6,FALSE)),\" \",VLOOKUP($B65,'EKC3'!$P$4:$V$48,6,FALSE))","v":" "},{"$f":"IF(ISNA(VLOOKUP($B65,'EKC4'!$P$4:$V$48,6,FALSE)),\" \",VLOOKUP($B65,'EKC4'!$P$4:$V$48,6,FALSE))","v":" "},{"$f":"IF(ISNA(VLOOKUP($B65,'EKC5'!$P$4:$V$48,6,FALSE)),\" \",VLOOKUP($B65,'EKC5'!$P$4:$V$48,6,FALSE))","v":" "}]
[63,{"$f":"IF(EQUIPES!G44>0,EQUIPES!A44,\"\")","v":""},0,"",{"$f":"IF(ISNA(VLOOKUP($B66,'EKC1'!$P$4:$U$48,6,FALSE)),\" \",VLOOKUP($B66,'EKC1'!$P$4:$U$48,6,FALSE))","v":" "},{"$f":"IF(ISNA(VLOOKUP($B66,'EKC2'!$P$4:$V$48,6,FALSE)),\" \",VLOOKUP($B66,'EKC2'!$P$4:$V$48,6,FALSE))","v":" "},{"$f":"IF(ISNA(VLOOKUP($B66,'EKC3'!$P$4:$V$48,6,FALSE)),\" \",VLOOKUP($B66,'EKC3'!$P$4:$V$48,6,FALSE))","v":" "},{"$f":"IF(ISNA(VLOOKUP($B66,'EKC4'!$P$4:$V$48,6,FALSE)),\" \",VLOOKUP($B66,'EKC4'!$P$4:$V$48,6,FALSE))","v":" "},{"$f":"IF(ISNA(VLOOKUP($B66,'EKC5'!$P$4:$V$48,6,FALSE)),\" \",VLOOKUP($B66,'EKC5'!$P$4:$V$48,6,FALSE))","v":" "}]
[64,{"$f":"IF(EQUIPES!G45>0,EQUIPES!A45,\"\")","v":""},0,"",{"$f":"IF(ISNA(VLOOKUP($B67,'EKC1'!$P$4:$U$48,6,FALSE)),\" \",VLOOKUP($B67,'EKC1'!$P$4:$U$48,6,FALSE))","v":" "},{"$f":"IF(ISNA(VLOOKUP($B67,'EKC2'!$P$4:$V$48,6,FALSE)),\" \",VLOOKUP($B67,'EKC2'!$P$4:$V$48,6,FALSE))","v":" "},{"$f":"IF(ISNA(VLOOKUP($B67,'EKC3'!$P$4:$V$48,6,FALSE)),\" \",VLOOKUP($B67,'EKC3'!$P$4:$V$48,6,FALSE))","v":" "},{"$f":"IF(ISNA(VLOOKUP($B67,'EKC4'!$P$4:$V$48,6,FALSE)),\" \",VLOOKUP($B67,'EKC4'!$P$4:$V$48,6,FALSE))","v":" "},{"$f":"IF(ISNA(VLOOKUP($B67,'EKC5'!$P$4:$V$48,6,FALSE)),\" \",VLOOKUP($B67,'EKC5'!$P$4:$V$48,6,FALSE))","v":" "}]
[65,{"$f":"IF(EQUIPES!G46>0,EQUIPES!A46,\"\")","v":""},{"$f":"SUM(E68:I68)","v":0},{"$f":"IF((COUNTIF(E68:I68,\">0\"))=0,\"\",COUNTIF(E68:I68,\">0\"))","v":""},{"$f":"IF(ISNA(VLOOKUP($B68,'EKC1'!$P$4:$U$48,6,FALSE)),\" \",VLOOKUP($B68,'EKC1'!$P$4:$U$48,6,FALSE))","v":" "},{"$f":"IF(ISNA(VLOOKUP($B68,'EKC2'!$P$4:$V$48,6,FALSE)),\" \",VLOOKUP($B68,'EKC2'!$P$4:$V$48,6,FALSE))","v":" "},{"$f":"IF(ISNA(VLOOKUP($B68,'EKC3'!$P$4:$V$48,6,FALSE)),\" \",VLOOKUP($B68,'EKC3'!$P$4:$V$48,6,FALSE))","v":" "},{"$f":"IF(ISNA(VLOOKUP($B68,'EKC4'!$P$4:$V$48,6,FALSE)),\" \",VLOOKUP($B68,'EKC4'!$P$4:$V$48,6,FALSE))","v":" "},{"$f":"IF(ISNA(VLOOKUP($B68,'EKC5'!$P$4:$V$48,6,FALSE)),\" \",VLOOKUP($B68,'EKC5'!$P$4:$V$48,6,FALSE))","v":" "}]
[66,{"$f":"IF(EQUIPES!G47>0,EQUIPES!A47,\"\")","v":""},0,"",{"$f":"IF(ISNA(VLOOKUP($B69,'EKC1'!$P$4:$U$48,6,FALSE)),\" \",VLOOKUP($B69,'EKC1'!$P$4:$U$48,6,FALSE))","v":" "},{"$f":"IF(ISNA(VLOOKUP($B69,'EKC2'!$P$4:$V$48,6,FALSE)),\" \",VLOOKUP($B69,'EKC2'!$P$4:$V$48,6,FALSE))","v":" "},{"$f":"IF(ISNA(VLOOKUP($B69,'EKC3'!$P$4:$V$48,6,FALSE)),\" \",VLOOKUP($B69,'EKC3'!$P$4:$V$48,6,FALSE))","v":" "},{"$f":"IF(ISNA(VLOOKUP($B69,'EKC4'!$P$4:$V$48,6,FALSE)),\" \",VLOOKUP($B69,'EKC4'!$P$4:$V$48,6,FALSE))","v":" "},{"$f":"IF(ISNA(VLOOKUP($B69,'EKC5'!$P$4:$V$48,6,FALSE)),\" \",VLOOKUP($B69,'EKC5'!$P$4:$V$48,6,FALSE))","v":" "}]
[67,{"$f":"IF(EQUIPES!G48>0,EQUIPES!A48,\"\")","v":""},0,"",{"$f":"IF(ISNA(VLOOKUP($B70,'EKC1'!$P$4:$U$48,6,FALSE)),\" \",VLOOKUP($B70,'EKC1'!$P$4:$U$48,6,FALSE))","v":" "},{"$f":"IF(ISNA(VLOOKUP($B70,'EKC2'!$P$4:$V$48,6,FALSE)),\" \",VLOOKUP($B70,'EKC2'!$P$4:$V$48,6,FALSE))","v":" "},{"$f":"IF(ISNA(VLOOKUP($B70,'EKC3'!$P$4:$V$48,6,FALSE)),\" \",VLOOKUP($B70,'EKC3'!$P$4:$V$48,6,FALSE))","v":" "},{"$f":"IF(ISNA(VLOOKUP($B70,'EKC4'!$P$4:$V$48,6,FALSE)),\" \",VLOOKUP($B70,'EKC4'!$P$4:$V$48,6,FALSE))","v":" "},{"$f":"IF(ISNA(VLOOKUP($B70,'EKC5'!$P$4:$V$48,6,FALSE)),\" \",VLOOKUP($B70,'EKC5'!$P$4:$V$48,6,FALSE))","v":" "}]
[68,{"$f":"IF(EQUIPES!G49>0,EQUIPES!A49,\"\")","v":""},0,"",{"$f":"IF(ISNA(VLOOKUP($B71,'EKC1'!$P$4:$U$48,6,FALSE)),\" \",VLOOKUP($B71,'EKC1'!$P$4:$U$48,6,FALSE))","v":" "},{"$f":"IF(ISNA(VLOOKUP($B71,'EKC2'!$P$4:$V$48,6,FALSE)),\" \",VLOOKUP($B71,'EKC2'!$P$4:$V$48,6,FALSE))","v":" "},{"$f":"IF(ISNA(VLOOKUP($B71,'EKC3'!$P$4:$V$48,6,FALSE)),\" \",VLOOKUP($B71,'EKC3'!$P$4:$V$48,6,FALSE))","v":" "},{"$f":"IF(ISNA(VLOOKUP($B71,'EKC4'!$P$4:$V$48,6,FALSE)),\" \",VLOOKUP($B71,'EKC4'!$P$4:$V$48,6,FALSE))","v":" "},{"$f":"IF(ISNA(VLOOKUP($B71,'EKC5'!$P$4:$V$48,6,FALSE)),\" \",VLOOKUP($B71,'EKC5'!$P$4:$V$48,6,FALSE))","v":" "}]
[69,{"$f":"IF(EQUIPES!G50>0,EQUIPES!A50,\"\")","v":""},0,"",{"$f":"IF(ISNA(VLOOKUP($B72,'EKC1'!$P$4:$U$48,6,FALSE)),\" \",VLOOKUP($B72,'EKC1'!$P$4:$U$48,6,FALSE))","v":" "},{"$f":"IF(ISNA(VLOOKUP($B72,'EKC2'!$P$4:$V$48,6,FALSE)),\" \",VLOOKUP($B72,'EKC2'!$P$4:$V$48,6,FALSE))","v":" "},{"$f":"IF(ISNA(VLOOKUP($B72,'EKC3'!$P$4:$V$48,6,FALSE)),\" \",VLOOKUP($B72,'EKC3'!$P$4:$V$48,6,FALSE))","v":" "},{"$f":"IF(ISNA(VLOOKUP($B72,'EKC4'!$P$4:$V$48,6,FALSE)),\" \",VLOOKUP($B72,'EKC4'!$P$4:$V$48,6,FALSE))","v":" "},{"$f":"IF(ISNA(VLOOKUP($B72,'EKC5'!$P$4:$V$48,6,FALSE)),\" \",VLOOKUP($B72,'EKC5'!$P$4:$V$48,6,FALSE))","v":" "}]
[70,{"$f":"IF(EQUIPES!G51>0,EQUIPES!A51,\"\")","v":""},0,"",{"$f":"IF(ISNA(VLOOKUP($B73,'EKC1'!$P$4:$U$48,6,FALSE)),\" \",VLOOKUP($B73,'EKC1'!$P$4:$U$48,6,FALSE))","v":" "},{"$f":"IF(ISNA(VLOOKUP($B73,'EKC2'!$P$4:$V$48,6,FALSE)),\" \",VLOOKUP($B73,'EKC2'!$P$4:$V$48,6,FALSE))","v":" "},{"$f":"IF(ISNA(VLOOKUP($B73,'EKC3'!$P$4:$V$48,6,FALSE)),\" \",VLOOKUP($B73,'EKC3'!$P$4:$V$48,6,FALSE))","v":" "},{"$f":"IF(ISNA(VLOOKUP($B73,'EKC4'!$P$4:$V$48,6,FALSE)),\" \",VLOOKUP($B73,'EKC4'!$P$4:$V$48,6,FALSE))","v":" "},{"$f":"IF(ISNA(VLOOKUP($B73,'EKC5'!$P$4:$V$48,6,FALSE)),\" \",VLOOKUP($B73,'EKC5'!$P$4:$V$48,6,FALSE))","v":" "}]
[71,{"$f":"IF(EQUIPES!G70>0,EQUIPES!A70,\"\")","v":""},0,"",{"$f":"IF(ISNA(VLOOKUP($B74,'EKC1'!$P$4:$U$48,6,FALSE)),\" \",VLOOKUP($B74,'EKC1'!$P$4:$U$48,6,FALSE))","v":" "},{"$f":"IF(ISNA(VLOOKUP($B74,'EKC2'!$P$4:$V$48,6,FALSE)),\" \",VLOOKUP($B74,'EKC2'!$P$4:$V$48,6,FALSE))","v":" "},{"$f":"IF(ISNA(VLOOKUP($B74,'EKC3'!$P$4:$V$48,6,FALSE)),\" \",VLOOKUP($B74,'EKC3'!$P$4:$V$48,6,FALSE))","v":" "},{"$f":"IF(ISNA(VLOOKUP($B74,'EKC4'!$P$4:$V$48,6,FALSE)),\" \",VLOOKUP($B74,'EKC4'!$P$4:$V$48,6,FALSE))","v":" "},{"$f":"IF(ISNA(VLOOKUP($B74,'EKC5'!$P$4:$V$48,6,FALSE)),\" \",VLOOKUP($B74,'EKC5'!$P$4:$V$48,6,FALSE))","v":" "}]
[72,{"$f":"IF(EQUIPES!G71>0,EQUIPES!A71,\"\")","v":""},0,"",{"$f":"IF(ISNA(VLOOKUP($B75,'EKC1'!$P$4:$U$48,6,FALSE)),\" \",VLOOKUP($B75,'EKC1'!$P$4:$U$48,6,FALSE))","v":" "},{"$f":"IF(ISNA(VLOOKUP($B75,'EKC2'!$P$4:$V$48,6,FALSE)),\" \",VLOOKUP($B75,'EKC2'!$P$4:$V$48,6,FALSE))","v":" "},{"$f":"IF(ISNA(VLOOKUP($B75,'EKC3'!$P$4:$V$48,6,FALSE)),\" \",VLOOKUP($B75,'EKC3'!$P$4:$V$48,6,FALSE))","v":" "},{"$f":"IF(ISNA(VLOOKUP($B75,'EKC4'!$P$4:$V$48,6,FALSE)),\" \",VLOOKUP($B75,'EKC4'!$P$4:$V$48,6,FALSE))","v":" "},{"$f":"IF(ISNA(VLOOKUP($B75,'EKC5'!$P$4:$V$48,6,FALSE)),\" \",VLOOKUP($B75,'EKC5'!$P$4:$V$48,6,FALSE))","v":" "}]
[73,{"$f":"IF(EQUIPES!G72>0,EQUIPES!A72,\"\")","v":""},0,"",{"$f":"IF(ISNA(VLOOKUP($B76,'EKC1'!$P$4:$U$48,6,FALSE)),\" \",VLOOKUP($B76,'EKC1'!$P$4:$U$48,6,FALSE))","v":" "},{"$f":"IF(ISNA(VLOOKUP($B76,'EKC2'!$P$4:$V$48,6,FALSE)),\" \",VLOOKUP($B76,'EKC2'!$P$4:$V$48,6,FALSE))","v":" "},{"$f":"IF(ISNA(VLOOKUP($B76,'EKC3'!$P$4:$V$48,6,FALSE)),\" \",VLOOKUP($B76,'EKC3'!$P$4:$V$48,6,FALSE))","v":" "},{"$f":"IF(ISNA(VLOOKUP($B76,'EKC4'!$P$4:$V$48,6,FALSE)),\" \",VLOOKUP($B76,'EKC4'!$P$4:$V$48,6,FALSE))","v":" "},{"$f":"IF(ISNA(VLOOKUP($B76,'EKC5'!$P$4:$V$48,6,FALSE)),\" \",VLOOKUP($B76,'EKC5'!$P$4:$V$48,6,FALSE))","v":" "}]
[74,{"$f":"IF(EQUIPES!G73>0,EQUIPES!A73,\"\")","v":""},0,"",{"$f":"IF(ISNA(VLOOKUP($B77,'EKC1'!$P$4:$U$48,6,FALSE)),\" \",VLOOKUP($B77,'EKC1'!$P$4:$U$48,6,FALSE))","v":" "},{"$f":"IF(ISNA(VLOOKUP($B77,'EKC2'!$P$4:$V$48,6,FALSE)),\" \",VLOOKUP($B77,'EKC2'!$P$4:$V$48,6,FALSE))","v":" "},{"$f":"IF(ISNA(VLOOKUP($B77,'EKC3'!$P$4:$V$48,6,FALSE)),\" \",VLOOKUP($B77,'EKC3'!$P$4:$V$48,6,FALSE))","v":" "},{"$f":"IF(ISNA(VLOOKUP($B77,'EKC4'!$P$4:$V$48,6,FALSE)),\" \",VLOOKUP($B77,'EKC4'!$P$4:$V$48,6,FALSE))","v":" "},{"$f":"IF(ISNA(VLOOKUP($B77,'EKC5'!$P$4:$V$48,6,FALSE)),\" \",VLOOKUP($B77,'EKC5'!$P$4:$V$48,6,FALSE))","v":" "}]
[75,{"$f":"IF(EQUIPES!G74>0,EQUIPES!A74,\"\")","v":""},0,"",{"$f":"IF(ISNA(VLOOKUP($B78,'EKC1'!$P$4:$U$48,6,FALSE)),\" \",VLOOKUP($B78,'EKC1'!$P$4:$U$48,6,FALSE))","v":" "},{"$f":"IF(ISNA(VLOOKUP($B78,'EKC2'!$P$4:$V$48,6,FALSE)),\" \",VLOOKUP($B78,'EKC2'!$P$4:$V$48,6,FALSE))","v":" "},{"$f":"IF(ISNA(VLOOKUP($B78,'EKC3'!$P$4:$V$48,6,FALSE)),\" \",VLOOKUP($B78,'EKC3'!$P$4:$V$48,6,FALSE))","v":" "},{"$f":"IF(ISNA(VLOOKUP($B78,'EKC4'!$P$4:$V$48,6,FALSE)),\" \",VLOOKUP($B78,'EKC4'!$P$4:$V$48,6,FALSE))","v":" "},{"$f":"IF(ISNA(VLOOKUP($B78,'EKC5'!$P$4:$V$48,6,FALSE)),\" \",VLOOKUP($B78,'EKC5'!$P$4:$V$48,6,FALSE))","v":" "}]
[76,{"$f":"IF(EQUIPES!G76>0,EQUIPES!A76,\"\")","v":""},0,"",{"$f":"IF(ISNA(VLOOKUP($B79,'EKC1'!$P$4:$U$48,6,FALSE)),\" \",VLOOKUP($B79,'EKC1'!$P$4:$U$48,6,FALSE))","v":" "},{"$f":"IF(ISNA(VLOOKUP($B79,'EKC2'!$P$4:$V$48,6,FALSE)),\" \",VLOOKUP($B79,'EKC2'!$P$4:$V$48,6,FALSE))","v":" "},{"$f":"IF(ISNA(VLOOKUP($B79,'EKC3'!$P$4:$V$48,6,FALSE)),\" \",VLOOKUP($B79,'EKC3'!$P$4:$V$48,6,FALSE))","v":" "},{"$f":"IF(ISNA(VLOOKUP($B79,'EKC4'!$P$4:$V$48,6,FALSE)),\" \",VLOOKUP($B79,'EKC4'!$P$4:$V$48,6,FALSE))","v":" "},{"$f":"IF(ISNA(VLOOKUP($B79,'EKC5'!$P$4:$V$48,6,FALSE)),\" \",VLOOKUP($B79,'EKC5'!$P$4:$V$48,6,FALSE))","v":" "}]
[77,{"$f":"IF(EQUIPES!G77>0,EQUIPES!A77,\"\")","v":""},0,"",{"$f":"IF(ISNA(VLOOKUP($B80,'EKC1'!$P$4:$U$48,6,FALSE)),\" \",VLOOKUP($B80,'EKC1'!$P$4:$U$48,6,FALSE))","v":" "},{"$f":"IF(ISNA(VLOOKUP($B80,'EKC2'!$P$4:$V$48,6,FALSE)),\" \",VLOOKUP($B80,'EKC2'!$P$4:$V$48,6,FALSE))","v":" "},{"$f":"IF(ISNA(VLOOKUP($B80,'EKC3'!$P$4:$V$48,6,FALSE)),\" \",VLOOKUP($B80,'EKC3'!$P$4:$V$48,6,FALSE))","v":" "},{"$f":"IF(ISNA(VLOOKUP($B80,'EKC4'!$P$4:$V$48,6,FALSE)),\" \",VLOOKUP($B80,'EKC4'!$P$4:$V$48,6,FALSE))","v":" "},{"$f":"IF(ISNA(VLOOKUP($B80,'EKC5'!$P$4:$V$48,6,FALSE)),\" \",VLOOKUP($B80,'EKC5'!$P$4:$V$48,6,FALSE))","v":" "}]
[78,{"$f":"IF(EQUIPES!G79>0,EQUIPES!A79,\"\")","v":""},0,"",{"$f":"IF(ISNA(VLOOKUP($B81,'EKC1'!$P$4:$U$48,6,FALSE)),\" \",VLOOKUP($B81,'EKC1'!$P$4:$U$48,6,FALSE))","v":" "},{"$f":"IF(ISNA(VLOOKUP($B81,'EKC2'!$P$4:$V$48,6,FALSE)),\" \",VLOOKUP($B81,'EKC2'!$P$4:$V$48,6,FALSE))","v":" "},{"$f":"IF(ISNA(VLOOKUP($B81,'EKC3'!$P$4:$V$48,6,FALSE)),\" \",VLOOKUP($B81,'EKC3'!$P$4:$V$48,6,FALSE))","v":" "},{"$f":"IF(ISNA(VLOOKUP($B81,'EKC4'!$P$4:$V$48,6,FALSE)),\" \",VLOOKUP($B81,'EKC4'!$P$4:$V$48,6,FALSE))","v":" "},{"$f":"IF(ISNA(VLOOKUP($B81,'EKC5'!$P$4:$V$48,6,FALSE)),\" \",VLOOKUP($B81,'EKC5'!$P$4:$V$48,6,FALSE))","v":" "}]
[79,{"$f":"IF(EQUIPES!G80>0,EQUIPES!A80,\"\")","v":""},0,"",{"$f":"IF(ISNA(VLOOKUP($B82,'EKC1'!$P$4:$U$48,6,FALSE)),\" \",VLOOKUP($B82,'EKC1'!$P$4:$U$48,6,FALSE))","v":" "},{"$f":"IF(ISNA(VLOOKUP($B82,'EKC2'!$P$4:$V$48,6,FALSE)),\" \",VLOOKUP($B82,'EKC2'!$P$4:$V$48,6,FALSE))","v":" "},{"$f":"IF(ISNA(VLOOKUP($B82,'EKC3'!$P$4:$V$48,6,FALSE)),\" \",VLOOKUP($B82,'EKC3'!$P$4:$V$48,6,FALSE))","v":" "},{"$f":"IF(ISNA(VLOOKUP($B82,'EKC4'!$P$4:$V$48,6,FALSE)),\" \",VLOOKUP($B82,'EKC4'!$P$4:$V$48,6,FALSE))","v":" "},{"$f":"IF(ISNA(VLOOKUP($B82,'EKC5'!$P$4:$V$48,6,FALSE)),\" \",VLOOKUP($B82,'EKC5'!$P$4:$V$48,6,FALSE))","v":" "}]
[80,{"$f":"IF(EQUIPES!G81>0,EQUIPES!A81,\"\")","v":""},0,"",{"$f":"IF(ISNA(VLOOKUP($B83,'EKC1'!$P$4:$U$48,6,FALSE)),\" \",VLOOKUP($B83,'EKC1'!$P$4:$U$48,6,FALSE))","v":" "},{"$f":"IF(ISNA(VLOOKUP($B83,'EKC2'!$P$4:$V$48,6,FALSE)),\" \",VLOOKUP($B83,'EKC2'!$P$4:$V$48,6,FALSE))","v":" "},{"$f":"IF(ISNA(VLOOKUP($B83,'EKC3'!$P$4:$V$48,6,FALSE)),\" \",VLOOKUP($B83,'EKC3'!$P$4:$V$48,6,FALSE))","v":" "},{"$f":"IF(ISNA(VLOOKUP($B83,'EKC4'!$P$4:$V$48,6,FALSE)),\" \",VLOOKUP($B83,'EKC4'!$P$4:$V$48,6,FALSE))","v":" "},{"$f":"IF(ISNA(VLOOKUP($B83,'EKC5'!$P$4:$V$48,6,FALSE)),\" \",VLOOKUP($B83,'EKC5'!$P$4:$V$48,6,FALSE))","v":" "}]
[81,{"$f":"IF(EQUIPES!G83>0,EQUIPES!A83,\"\")","v":""},0,"",{"$f":"IF(ISNA(VLOOKUP($B84,'EKC1'!$P$4:$U$48,6,FALSE)),\" \",VLOOKUP($B84,'EKC1'!$P$4:$U$48,6,FALSE))","v":" "},{"$f":"IF(ISNA(VLOOKUP($B84,'EKC2'!$P$4:$V$48,6,FALSE)),\" \",VLOOKUP($B84,'EKC2'!$P$4:$V$48,6,FALSE))","v":" "},{"$f":"IF(ISNA(VLOOKUP($B84,'EKC3'!$P$4:$V$48,6,FALSE)),\" \",VLOOKUP($B84,'EKC3'!$P$4:$V$48,6,FALSE))","v":" "},{"$f":"IF(ISNA(VLOOKUP($B84,'EKC4'!$P$4:$V$48,6,FALSE)),\" \",VLOOKUP($B84,'EKC4'!$P$4:$V$48,6,FALSE))","v":" "},{"$f":"IF(ISNA(VLOOKUP($B84,'EKC5'!$P$4:$V$48,6,FALSE)),\" \",VLOOKUP($B84,'EKC5'!$P$4:$V$48,6,FALSE))","v":" "}]
[82,{"$f":"IF(EQUIPES!G84>0,EQUIPES!A84,\"\")","v":""},0,"",{"$f":"IF(ISNA(VLOOKUP($B85,'EKC1'!$P$4:$U$48,6,FALSE)),\" \",VLOOKUP($B85,'EKC1'!$P$4:$U$48,6,FALSE))","v":" "},{"$f":"IF(ISNA(VLOOKUP($B85,'EKC2'!$P$4:$V$48,6,FALSE)),\" \",VLOOKUP($B85,'EKC2'!$P$4:$V$48,6,FALSE))","v":" "},{"$f":"IF(ISNA(VLOOKUP($B85,'EKC3'!$P$4:$V$48,6,FALSE)),\" \",VLOOKUP($B85,'EKC3'!$P$4:$V$48,6,FALSE))","v":" "},{"$f":"IF(ISNA(VLOOKUP($B85,'EKC4'!$P$4:$V$48,6,FALSE)),\" \",VLOOKUP($B85,'EKC4'!$P$4:$V$48,6,FALSE))","v":" "},{"$f":"IF(ISNA(VLOOKUP($B85,'EKC5'!$P$4:$V$48,6,FALSE)),\" \",VLOOKUP($B85,'EKC5'!$P$4:$V$48,6,FALSE))","v":" "}]
[83,{"$f":"IF(EQUIPES!G85>0,EQUIPES!A85,\"\")","v":""},0,"",{"$f":"IF(ISNA(VLOOKUP($B86,'EKC1'!$P$4:$U$48,6,FALSE)),\" \",VLOOKUP($B86,'EKC1'!$P$4:$U$48,6,FALSE))","v":" "},{"$f":"IF(ISNA(VLOOKUP($B86,'EKC2'!$P$4:$V$48,6,FALSE)),\" \",VLOOKUP($B86,'EKC2'!$P$4:$V$48,6,FALSE))","v":" "},{"$f":"IF(ISNA(VLOOKUP($B86,'EKC3'!$P$4:$V$48,6,FALSE)),\" \",VLOOKUP($B86,'EKC3'!$P$4:$V$48,6,FALSE))","v":" "},{"$f":"IF(ISNA(VLOOKUP($B86,'EKC4'!$P$4:$V$48,6,FALSE)),\" \",VLOOKUP($B86,'EKC4'!$P$4:$V$48,6,FALSE))","v":" "},{"$f":"IF(ISNA(VLOOKUP($B86,'EKC5'!$P$4:$V$48,6,FALSE)),\" \",VLOOKUP($B86,'EKC5'!$P$4:$V$48,6,FALSE))","v":" "}]
[84,{"$f":"IF(EQUIPES!G86>0,EQUIPES!A86,\"\")","v":""},0,"",{"$f":"IF(ISNA(VLOOKUP($B87,'EKC1'!$P$4:$U$48,6,FALSE)),\" \",VLOOKUP($B87,'EKC1'!$P$4:$U$48,6,FALSE))","v":" "},{"$f":"IF(ISNA(VLOOKUP($B87,'EKC2'!$P$4:$V$48,6,FALSE)),\" \",VLOOKUP($B87,'EKC2'!$P$4:$V$48,6,FALSE))","v":" "},{"$f":"IF(ISNA(VLOOKUP($B87,'EKC3'!$P$4:$V$48,6,FALSE)),\" \",VLOOKUP($B87,'EKC3'!$P$4:$V$48,6,FALSE))","v":" "},{"$f":"IF(ISNA(VLOOKUP($B87,'EKC4'!$P$4:$V$48,6,FALSE)),\" \",VLOOKUP($B87,'EKC4'!$P$4:$V$48,6,FALSE))","v":" "},{"$f":"IF(ISNA(VLOOKUP($B87,'EKC5'!$P$4:$V$48,6,FALSE)),\" \",VLOOKUP($B87,'EKC5'!$P$4:$V$48,6,FALSE))","v":" "}]
[85,{"$f":"IF(EQUIPES!G87>0,EQUIPES!A87,\"\")","v":""},0,"",{"$f":"IF(ISNA(VLOOKUP($B88,'EKC1'!$P$4:$U$48,6,FALSE)),\" \",VLOOKUP($B88,'EKC1'!$P$4:$U$48,6,FALSE))","v":" "},{"$f":"IF(ISNA(VLOOKUP($B88,'EKC2'!$P$4:$V$48,6,FALSE)),\" \",VLOOKUP($B88,'EKC2'!$P$4:$V$48,6,FALSE))","v":" "},{"$f":"IF(ISNA(VLOOKUP($B88,'EKC3'!$P$4:$V$48,6,FALSE)),\" \",VLOOKUP($B88,'EKC3'!$P$4:$V$48,6,FALSE))","v":" "},{"$f":"IF(ISNA(VLOOKUP($B88,'EKC4'!$P$4:$V$48,6,FALSE)),\" \",VLOOKUP($B88,'EKC4'!$P$4:$V$48,6,FALSE))","v":" "},{"$f":"IF(ISNA(VLOOKUP($B88,'EKC5'!$P$4:$V$48,6,FALSE)),\" \",VLOOKUP($B88,'EKC5'!$P$4:$V$48,6,FALSE))","v":" "}]
[86,{"$f":"IF(EQUIPES!G88>0,EQUIPES!A88,\"\")","v":""},0,"",{"$f":"IF(ISNA(VLOOKUP($B89,'EKC1'!$P$4:$U$48,6,FALSE)),\" \",VLOOKUP($B89,'EKC1'!$P$4:$U$48,6,FALSE))","v":" "},{"$f":"IF(ISNA(VLOOKUP($B89,'EKC2'!$P$4:$V$48,6,FALSE)),\" \",VLOOKUP($B89,'EKC2'!$P$4:$V$48,6,FALSE))","v":" "},{"$f":"IF(ISNA(VLOOKUP($B89,'EKC3'!$P$4:$V$48,6,FALSE)),\" \",VLOOKUP($B89,'EKC3'!$P$4:$V$48,6,FALSE))","v":" "},{"$f":"IF(ISNA(VLOOKUP($B89,'EKC4'!$P$4:$V$48,6,FALSE)),\" \",VLOOKUP($B89,'EKC4'!$P$4:$V$48,6,FALSE))","v":" "},{"$f":"IF(ISNA(VLOOKUP($B89,'EKC5'!$P$4:$V$48,6,FALSE)),\" \",VLOOKUP($B89,'EKC5'!$P$4:$V$48,6,FALSE))","v":" "}]
[87,{"$f":"IF(EQUIPES!G89>0,EQUIPES!A89,\"\")","v":""},0,"",{"$f":"IF(ISNA(VLOOKUP($B90,'EKC1'!$P$4:$U$48,6,FALSE)),\" \",VLOOKUP($B90,'EKC1'!$P$4:$U$48,6,FALSE))","v":" "},{"$f":"IF(ISNA(VLOOKUP($B90,'EKC2'!$P$4:$V$48,6,FALSE)),\" \",VLOOKUP($B90,'EKC2'!$P$4:$V$48,6,FALSE))","v":" "},{"$f":"IF(ISNA(VLOOKUP($B90,'EKC3'!$P$4:$V$48,6,FALSE)),\" \",VLOOKUP($B90,'EKC3'!$P$4:$V$48,6,FALSE))","v":" "},{"$f":"IF(ISNA(VLOOKUP($B90,'EKC4'!$P$4:$V$48,6,FALSE)),\" \",VLOOKUP($B90,'EKC4'!$P$4:$V$48,6,FALSE))","v":" "},{"$f":"IF(ISNA(VLOOKUP($B90,'EKC5'!$P$4:$V$48,6,FALSE)),\" \",VLOOKUP($B90,'EKC5'!$P$4:$V$48,6,FALSE))","v":" "}]
[88,{"$f":"IF(EQUIPES!G90>0,EQUIPES!A90,\"\")","v":""},0,"",{"$f":"IF(ISNA(VLOOKUP($B91,'EKC1'!$P$4:$U$48,6,FALSE)),\" \",VLOOKUP($B91,'EKC1'!$P$4:$U$48,6,FALSE))","v":" "},{"$f":"IF(ISNA(VLOOKUP($B91,'EKC2'!$P$4:$V$48,6,FALSE)),\" \",VLOOKUP($B91,'EKC2'!$P$4:$V$48,6,FALSE))","v":" "},{"$f":"IF(ISNA(VLOOKUP($B91,'EKC3'!$P$4:$V$48,6,FALSE)),\" \",VLOOKUP($B91,'EKC3'!$P$4:$V$48,6,FALSE))","v":" "},{"$f":"IF(ISNA(VLOOKUP($B91,'EKC4'!$P$4:$V$48,6,FALSE)),\" \",VLOOKUP($B91,'EKC4'!$P$4:$V$48,6,FALSE))","v":" "},{"$f":"IF(ISNA(VLOOKUP($B91,'EKC5'!$P$4:$V$48,6,FALSE)),\" \",VLOOKUP($B91,'EKC5'!$P$4:$V$48,6,FALSE))","v":" "}]
[89,{"$f":"IF(EQUIPES!G91>0,EQUIPES!A91,\"\")","v":""},0,"",{"$f":"IF(ISNA(VLOOKUP($B92,'EKC1'!$P$4:$U$48,6,FALSE)),\" \",VLOOKUP($B92,'EKC1'!$P$4:$U$48,6,FALSE))","v":" "},{"$f":"IF(ISNA(VLOOKUP($B92,'EKC2'!$P$4:$V$48,6,FALSE)),\" \",VLOOKUP($B92,'EKC2'!$P$4:$V$48,6,FALSE))","v":" "},{"$f":"IF(ISNA(VLOOKUP($B92,'EKC3'!$P$4:$V$48,6,FALSE)),\" \",VLOOKUP($B92,'EKC3'!$P$4:$V$48,6,FALSE))","v":" "},{"$f":"IF(ISNA(VLOOKUP($B92,'EKC4'!$P$4:$V$48,6,FALSE)),\" \",VLOOKUP($B92,'EKC4'!$P$4:$V$48,6,FALSE))","v":" "},{"$f":"IF(ISNA(VLOOKUP($B92,'EKC5'!$P$4:$V$48,6,FALSE)),\" \",VLOOKUP($B92,'EKC5'!$P$4:$V$48,6,FALSE))","v":" "}]
[90,{"$f":"IF(EQUIPES!G92>0,EQUIPES!A92,\"\")","v":""},0,"",{"$f":"IF(ISNA(VLOOKUP($B93,'EKC1'!$P$4:$U$48,6,FALSE)),\" \",VLOOKUP($B93,'EKC1'!$P$4:$U$48,6,FALSE))","v":" "},{"$f":"IF(ISNA(VLOOKUP($B93,'EKC2'!$P$4:$V$48,6,FALSE)),\" \",VLOOKUP($B93,'EKC2'!$P$4:$V$48,6,FALSE))","v":" "},{"$f":"IF(ISNA(VLOOKUP($B93,'EKC3'!$P$4:$V$48,6,FALSE)),\" \",VLOOKUP($B93,'EKC3'!$P$4:$V$48,6,FALSE))","v":" "},{"$f":"IF(ISNA(VLOOKUP($B93,'EKC4'!$P$4:$V$48,6,FALSE)),\" \",VLOOKUP($B93,'EKC4'!$P$4:$V$48,6,FALSE))","v":" "},{"$f":"IF(ISNA(VLOOKUP($B93,'EKC5'!$P$4:$V$48,6,FALSE)),\" \",VLOOKUP($B93,'EKC5'!$P$4:$V$48,6,FALSE))","v":" "}]
[91,{"$f":"IF(EQUIPES!G93>0,EQUIPES!A93,\"\")","v":""},0,"",{"$f":"IF(ISNA(VLOOKUP($B94,'EKC1'!$P$4:$U$48,6,FALSE)),\" \",VLOOKUP($B94,'EKC1'!$P$4:$U$48,6,FALSE))","v":" "},{"$f":"IF(ISNA(VLOOKUP($B94,'EKC2'!$P$4:$V$48,6,FALSE)),\" \",VLOOKUP($B94,'EKC2'!$P$4:$V$48,6,FALSE))","v":" "},{"$f":"IF(ISNA(VLOOKUP($B94,'EKC3'!$P$4:$V$48,6,FALSE)),\" \",VLOOKUP($B94,'EKC3'!$P$4:$V$48,6,FALSE))","v":" "},{"$f":"IF(ISNA(VLOOKUP($B94,'EKC4'!$P$4:$V$48,6,FALSE)),\" \",VLOOKUP($B94,'EKC4'!$P$4:$V$48,6,FALSE))","v":" "},{"$f":"IF(ISNA(VLOOKUP($B94,'EKC5'!$P$4:$V$48,6,FALSE)),\" \",VLOOKUP($B94,'EKC5'!$P$4:$V$48,6,FALSE))","v":" "}]
[92,{"$f":"IF(EQUIPES!G94>0,EQUIPES!A94,\"\")","v":""},0,"",{"$f":"IF(ISNA(VLOOKUP($B95,'EKC1'!$P$4:$U$48,6,FALSE)),\" \",VLOOKUP($B95,'EKC1'!$P$4:$U$48,6,FALSE))","v":" "},{"$f":"IF(ISNA(VLOOKUP($B95,'EKC2'!$P$4:$V$48,6,FALSE)),\" \",VLOOKUP($B95,'EKC2'!$P$4:$V$48,6,FALSE))","v":" "},{"$f":"IF(ISNA(VLOOKUP($B95,'EKC3'!$P$4:$V$48,6,FALSE)),\" \",VLOOKUP($B95,'EKC3'!$P$4:$V$48,6,FALSE))","v":" "},{"$f":"IF(ISNA(VLOOKUP($B95,'EKC4'!$P$4:$V$48,6,FALSE)),\" \",VLOOKUP($B95,'EKC4'!$P$4:$V$48,6,FALSE))","v":" "},{"$f":"IF(ISNA(VLOOKUP($B95,'EKC5'!$P$4:$V$48,6,FALSE)),\" \",VLOOKUP($B95,'EKC5'!$P$4:$V$48,6,FALSE))","v":" "}]
[93,{"$f":"IF(EQUIPES!G95>0,EQUIPES!A95,\"\")","v":""},0,"",{"$f":"IF(ISNA(VLOOKUP($B96,'EKC1'!$P$4:$U$48,6,FALSE)),\" \",VLOOKUP($B96,'EKC1'!$P$4:$U$48,6,FALSE))","v":" "},{"$f":"IF(ISNA(VLOOKUP($B96,'EKC2'!$P$4:$V$48,6,FALSE)),\" \",VLOOKUP($B96,'EKC2'!$P$4:$V$48,6,FALSE))","v":" "},{"$f":"IF(ISNA(VLOOKUP($B96,'EKC3'!$P$4:$V$48,6,FALSE)),\" \",VLOOKUP($B96,'EKC3'!$P$4:$V$48,6,FALSE))","v":" "},{"$f":"IF(ISNA(VLOOKUP($B96,'EKC4'!$P$4:$V$48,6,FALSE)),\" \",VLOOKUP($B96,'EKC4'!$P$4:$V$48,6,FALSE))","v":" "},{"$f":"IF(ISNA(VLOOKUP($B96,'EKC5'!$P$4:$V$48,6,FALSE)),\" \",VLOOKUP($B96,'EKC5'!$P$4:$V$48,6,FALSE))","v":" "}]
[94,{"$f":"IF(EQUIPES!G96>0,EQUIPES!A96,\"\")","v":""},0,"",{"$f":"IF(ISNA(VLOOKUP($B97,'EKC1'!$P$4:$U$48,6,FALSE)),\" \",VLOOKUP($B97,'EKC1'!$P$4:$U$48,6,FALSE))","v":" "},{"$f":"IF(ISNA(VLOOKUP($B97,'EKC2'!$P$4:$V$48,6,FALSE)),\" \",VLOOKUP($B97,'EKC2'!$P$4:$V$48,6,FALSE))","v":" "},{"$f":"IF(ISNA(VLOOKUP($B97,'EKC3'!$P$4:$V$48,6,FALSE)),\" \",VLOOKUP($B97,'EKC3'!$P$4:$V$48,6,FALSE))","v":" "},{"$f":"IF(ISNA(VLOOKUP($B97,'EKC4'!$P$4:$V$48,6,FALSE)),\" \",VLOOKUP($B97,'EKC4'!$P$4:$V$48,6,FALSE))","v":" "},{"$f":"IF(ISNA(VLOOKUP($B97,'EKC5'!$P$4:$V$48,6,FALSE)),\" \",VLOOKUP($B97,'EKC5'!$P$4:$V$48,6,FALSE))","v":" "}]
[95,{"$f":"IF(EQUIPES!G97>0,EQUIPES!A97,\"\")","v":""},0,"",{"$f":"IF(ISNA(VLOOKUP($B98,'EKC1'!$P$4:$U$48,6,FALSE)),\" \",VLOOKUP($B98,'EKC1'!$P$4:$U$48,6,FALSE))","v":" "},{"$f":"IF(ISNA(VLOOKUP($B98,'EKC2'!$P$4:$V$48,6,FALSE)),\" \",VLOOKUP($B98,'EKC2'!$P$4:$V$48,6,FALSE))","v":" "},{"$f":"IF(ISNA(VLOOKUP($B98,'EKC3'!$P$4:$V$48,6,FALSE)),\" \",VLOOKUP($B98,'EKC3'!$P$4:$V$48,6,FALSE))","v":" "},{"$f":"IF(ISNA(VLOOKUP($B98,'EKC4'!$P$4:$V$48,6,FALSE)),\" \",VLOOKUP($B98,'EKC4'!$P$4:$V$48,6,FALSE))","v":" "},{"$f":"IF(ISNA(VLOOKUP($B98,'EKC5'!$P$4:$V$48,6,FALSE)),\" \",VLOOKUP($B98,'EKC5'!$P$4:$V$48,6,FALSE))","v":" "}]
[96,{"$f":"IF(EQUIPES!G98>0,EQUIPES!A98,\"\")","v":""},0,"",{"$f":"IF(ISNA(VLOOKUP($B99,'EKC1'!$P$4:$U$48,6,FALSE)),\" \",VLOOKUP($B99,'EKC1'!$P$4:$U$48,6,FALSE))","v":" "},{"$f":"IF(ISNA(VLOOKUP($B99,'EKC2'!$P$4:$V$48,6,FALSE)),\" \",VLOOKUP($B99,'EKC2'!$P$4:$V$48,6,FALSE))","v":" "},{"$f":"IF(ISNA(VLOOKUP($B99,'EKC3'!$P$4:$V$48,6,FALSE)),\" \",VLOOKUP($B99,'EKC3'!$P$4:$V$48,6,FALSE))","v":" "},{"$f":"IF(ISNA(VLOOKUP($B99,'EKC4'!$P$4:$V$48,6,FALSE)),\" \",VLOOKUP($B99,'EKC4'!$P$4:$V$48,6,FALSE))","v":" "},{"$f":"IF(ISNA(VLOOKUP($B99,'EKC5'!$P$4:$V$48,6,FALSE)),\" \",VLOOKUP($B99,'EKC5'!$P$4:$V$48,6,FALSE))","v":" "}]
[97,{"$f":"IF(EQUIPES!G99>0,EQUIPES!A99,\"\")","v":""},0,{"$f":"IF((COUNTIF(E100:I100,\">0\"))=0,\"\",COUNTIF(E100:I100,\">0\"))","v":""},{"$f":"IF(ISNA(VLOOKUP($B100,'EKC1'!$P$4:$U$48,6,FALSE)),\" \",VLOOKUP($B100,'EKC1'!$P$4:$U$48,6,FALSE))","v":" "},{"$f":"IF(ISNA(VLOOKUP($B100,'EKC2'!$P$4:$V$48,6,FALSE)),\" \",VLOOKUP($B100,'EKC2'!$P$4:$V$48,6,FALSE))","v":" "},{"$f":"IF(ISNA(VLOOKUP($B100,'EKC3'!$P$4:$V$48,6,FALSE)),\" \",VLOOKUP($B100,'EKC3'!$P$4:$V$48,6,FALSE))","v":" "},{"$f":"IF(ISNA(VLOOKUP($B100,'EKC4'!$P$4:$V$48,6,FALSE)),\" \",VLOOKUP($B100,'EKC4'!$P$4:$V$48,6,FALSE))","v":" "},{"$f":"IF(ISNA(VLOOKUP($B100,'EKC5'!$P$4:$V$48,6,FALSE)),\" \",VLOOKUP($B100,'EKC5'!$P$4:$V$48,6,FALSE))","v":" "}]
[98,{"$f":"IF(EQUIPES!G100>0,EQUIPES!A100,\"\")","v":""},0,"",{"$f":"IF(ISNA(VLOOKUP($B101,'EKC1'!$P$4:$U$48,6,FALSE)),\" \",VLOOKUP($B101,'EKC1'!$P$4:$U$48,6,FALSE))","v":" "},{"$f":"IF(ISNA(VLOOKUP($B101,'EKC2'!$P$4:$V$48,6,FALSE)),\" \",VLOOKUP($B101,'EKC2'!$P$4:$V$48,6,FALSE))","v":" "},{"$f":"IF(ISNA(VLOOKUP($B101,'EKC3'!$P$4:$V$48,6,FALSE)),\" \",VLOOKUP($B101,'EKC3'!$P$4:$V$48,6,FALSE))","v":" "},{"$f":"IF(ISNA(VLOOKUP($B101,'EKC4'!$P$4:$V$48,6,FALSE)),\" \",VLOOKUP($B101,'EKC4'!$P$4:$V$48,6,FALSE))","v":" "},{"$f":"IF(ISNA(VLOOKUP($B101,'EKC5'!$P$4:$V$48,6,FALSE)),\" \",VLOOKUP($B101,'EKC5'!$P$4:$V$48,6,FALSE))","v":" "}]
[99,{"$f":"IF(EQUIPES!G101>0,EQUIPES!A101,\"\")","v":""},0,"",{"$f":"IF(ISNA(VLOOKUP($B102,'EKC1'!$P$4:$U$48,6,FALSE)),\" \",VLOOKUP($B102,'EKC1'!$P$4:$U$48,6,FALSE))","v":" "},{"$f":"IF(ISNA(VLOOKUP($B102,'EKC2'!$P$4:$V$48,6,FALSE)),\" \",VLOOKUP($B102,'EKC2'!$P$4:$V$48,6,FALSE))","v":" "},{"$f":"IF(ISNA(VLOOKUP($B102,'EKC3'!$P$4:$V$48,6,FALSE)),\" \",VLOOKUP($B102,'EKC3'!$P$4:$V$48,6,FALSE))","v":" "},{"$f":"IF(ISNA(VLOOKUP($B102,'EKC4'!$P$4:$V$48,6,FALSE)),\" \",VLOOKUP($B102,'EKC4'!$P$4:$V$48,6,FALSE))","v":" "},{"$f":"IF(ISNA(VLOOKUP($B102,'EKC5'!$P$4:$V$48,6,FALSE)),\" \",VLOOKUP($B102,'EKC5'!$P$4:$V$48,6,FALSE))","v":" "}]
[100,{"$f":"IF(EQUIPES!G102>0,EQUIPES!A102,\"\")","v":""},0,"",{"$f":"IF(ISNA(VLOOKUP($B103,'EKC1'!$P$4:$U$48,6,FALSE)),\" \",VLOOKUP($B103,'EKC1'!$P$4:$U$48,6,FALSE))","v":" "},{"$f":"IF(ISNA(VLOOKUP($B103,'EKC2'!$P$4:$V$48,6,FALSE)),\" \",VLOOKUP($B103,'EKC2'!$P$4:$V$48,6,FALSE))","v":" "},{"$f":"IF(ISNA(VLOOKUP($B103,'EKC3'!$P$4:$V$48,6,FALSE)),\" \",VLOOKUP($B103,'EKC3'!$P$4:$V$48,6,FALSE))","v":" "},{"$f":"IF(ISNA(VLOOKUP($B103,'EKC4'!$P$4:$V$48,6,FALSE)),\" \",VLOOKUP($B103,'EKC4'!$P$4:$V$48,6,FALSE))","v":" "},{"$f":"IF(ISNA(VLOOKUP($B103,'EKC5'!$P$4:$V$48,6,FALSE)),\" \",VLOOKUP($B103,'EKC5'!$P$4:$V$48,6,FALSE))","v":" "}]

{"sheet":"EQUIPES","index":1,"n_rows":201,"n_cols":11,"rows_kept":201,"cut":false,"hidden":false,"merged":[]}
["---",{"$f":"SUM(B2:B200)","v":16},{"$f":"SUM(C2:C200)","v":0},{"$f":"SUM(D2:D200)","v":0},{"$f":"SUM(E2:E200)","v":0},{"$f":"SUM(F2:F200)","v":0},{"$f":"COUNTIF(G3:G200,\">\"&0)","v":16},null,null,"Double saisie"]
["_ _",{"$f":"IF(ISNA(VLOOKUP($A2,'EKC1'!$P$4:$AA$48,5,FALSE)),\"\",VLOOKUP($A2,'EKC1'!$P$4:$AA$48,5,FALSE))","v":""},{"$f":"IF(ISNA(VLOOKUP($A2,'EKC2'!$P$4:$AA$48,5,FALSE)),\"\",VLOOKUP($A2,'EKC2'!$P$4:$AA$48,5,FALSE))","v":""},{"$f":"IF(ISNA(VLOOKUP($A2,'EKC3'!$P$4:$AA$48,5,FALSE)),\"\",VLOOKUP($A2,'EKC3'!$P$4:$AA$48,5,FALSE))","v":""},{"$f":"IF(ISNA(VLOOKUP($A2,'EKC4'!$P$4:$AA$48,5,FALSE)),\"\",VLOOKUP($A2,'EKC4'!$P$4:$AA$48,5,FALSE))","v":""},{"$f":"IF(ISNA(VLOOKUP($A2,'EKC5'!$P$4:$AA$48,5,FALSE)),\"\",VLOOKUP($A2,'EKC5'!$P$4:$AA$48,5,FALSE))","v":""},{"$f":"IF(SUM(B2:F2)=0,\"\",SUM(B2:F2))","v":""},null,null,{"$f":"SUM(J3:J200)","v":0}]
["ALFA ROMEO RACING",{"$f":"IF(ISNA(VLOOKUP($A3,'EKC1'!$P$4:$AB$48,12,FALSE)),\"\",VLOOKUP($A3,'EKC1'!$P$4:$AB$48,12,FALSE))","v":1},{"$f":"IF(ISNA(VLOOKUP($A3,'EKC2'!$P$4:$AB$48,12,FALSE)),\"\",VLOOKUP($A3,'EKC2'!$P$4:$AB$48,12,FALSE))","v":""},{"$f":"IF(ISNA(VLOOKUP($A3,'EKC3'!$P$4:$AB$48,12,FALSE)),\"\",VLOOKUP($A3,'EKC3'!$P$4:$AB$48,12,FALSE))","v":""},{"$f":"IF(ISNA(VLOOKUP($A3,'EKC4'!$P$4:$AB$48,12,FALSE)),\"\",VLOOKUP($A3,'EKC4'!$P$4:$AB$48,12,FALSE))","v":""},{"$f":"IF(ISNA(VLOOKUP($A3,'EKC5'!$P$4:$AB$48,12,FALSE)),\"\",VLOOKUP($A3,'EKC5'!$P$4:$AB$48,12,FALSE))","v":""},{"$f":"IF(SUM(B3:F3)=0,0,SUM(B3:F3))","v":1},null,null,{"$f":"IF(ISBLANK(A3),\"\",IF(A4=A3,1,\"\"))","v":""},{"$f":"IF(G3>0,1,0)","v":1}]
["CAEN VERANDAS",{"$f":"IF(ISNA(VLOOKUP($A4,'EKC1'!$P$4:$AB$48,12,FALSE)),\"\",VLOOKUP($A4,'EKC1'!$P$4:$AB$48,12,FALSE))","v":1},{"$f":"IF(ISNA(VLOOKUP($A4,'EKC2'!$P$4:$AB$48,12,FALSE)),\"\",VLOOKUP($A4,'EKC2'!$P$4:$AB$48,12,FALSE))","v":""},{"$f":"IF(ISNA(VLOOKUP($A4,'EKC3'!$P$4:$AB$48,12,FALSE)),\"\",VLOOKUP($A4,'EKC3'!$P$4:$AB$48,12,FALSE))","v":""},{"$f":"IF(ISNA(VLOOKUP($A4,'EKC4'!$P$4:$AB$48,12,FALSE)),\"\",VLOOKUP($A4,'EKC4'!$P$4:$AB$48,12,FALSE))","v":""},{"$f":"IF(ISNA(VLOOKUP($A4,'EKC5'!$P$4:$AB$48,12,FALSE)),\"\",VLOOKUP($A4,'EKC5'!$P$4:$AB$48,12,FALSE))","v":""},{"$f":"IF(SUM(B4:F4)=0,0,SUM(B4:F4))","v":1},null,null,{"$f":"IF(ISBLANK(A4),\"\",IF(A5=A4,1,\"\"))","v":""},{"$f":"IF(ISBLANK(A5),0,1)","v":1}]
["ERK TEAM",{"$f":"IF(ISNA(VLOOKUP($A5,'EKC1'!$P$4:$AB$48,12,FALSE)),\"\",VLOOKUP($A5,'EKC1'!$P$4:$AB$48,12,FALSE))","v":1},{"$f":"IF(ISNA(VLOOKUP($A5,'EKC2'!$P$4:$AB$48,12,FALSE)),\"\",VLOOKUP($A5,'EKC2'!$P$4:$AB$48,12,FALSE))","v":""},{"$f":"IF(ISNA(VLOOKUP($A5,'EKC3'!$P$4:$AB$48,12,FALSE)),\"\",VLOOKUP($A5,'EKC3'!$P$4:$AB$48,12,FALSE))","v":""},{"$f":"IF(ISNA(VLOOKUP($A5,'EKC4'!$P$4:$AB$48,12,FALSE)),\"\",VLOOKUP($A5,'EKC4'!$P$4:$AB$48,12,FALSE))","v":""},{"$f":"IF(ISNA(VLOOKUP($A5,'EKC5'!$P$4:$AB$48,12,FALSE)),\"\",VLOOKUP($A5,'EKC5'!$P$4:$AB$48,12,FALSE))","v":""},1,null,null,"",1]
["ESSO SPORT",{"$f":"IF(ISNA(VLOOKUP($A6,'EKC1'!$P$4:$AB$48,12,FALSE)),\"\",VLOOKUP($A6,'EKC1'!$P$4:$AB$48,12,FALSE))","v":1},{"$f":"IF(ISNA(VLOOKUP($A6,'EKC2'!$P$4:$AB$48,12,FALSE)),\"\",VLOOKUP($A6,'EKC2'!$P$4:$AB$48,12,FALSE))","v":""},{"$f":"IF(ISNA(VLOOKUP($A6,'EKC3'!$P$4:$AB$48,12,FALSE)),\"\",VLOOKUP($A6,'EKC3'!$P$4:$AB$48,12,FALSE))","v":""},{"$f":"IF(ISNA(VLOOKUP($A6,'EKC4'!$P$4:$AB$48,12,FALSE)),\"\",VLOOKUP($A6,'EKC4'!$P$4:$AB$48,12,FALSE))","v":""},{"$f":"IF(ISNA(VLOOKUP($A6,'EKC5'!$P$4:$AB$48,12,FALSE)),\"\",VLOOKUP($A6,'EKC5'!$P$4:$AB$48,12,FALSE))","v":""},1,null,null,"",1]
["FEEL EUROPE",{"$f":"IF(ISNA(VLOOKUP($A7,'EKC1'!$P$4:$AB$48,12,FALSE)),\"\",VLOOKUP($A7,'EKC1'!$P$4:$AB$48,12,FALSE))","v":1},{"$f":"IF(ISNA(VLOOKUP($A7,'EKC2'!$P$4:$AB$48,12,FALSE)),\"\",VLOOKUP($A7,'EKC2'!$P$4:$AB$48,12,FALSE))","v":""},{"$f":"IF(ISNA(VLOOKUP($A7,'EKC3'!$P$4:$AB$48,12,FALSE)),\"\",VLOOKUP($A7,'EKC3'!$P$4:$AB$48,12,FALSE))","v":""},{"$f":"IF(ISNA(VLOOKUP($A7,'EKC4'!$P$4:$AB$48,12,FALSE)),\"\",VLOOKUP($A7,'EKC4'!$P$4:$AB$48,12,FALSE))","v":""},{"$f":"IF(ISNA(VLOOKUP($A7,'EKC5'!$P$4:$AB$48,12,FALSE)),\"\",VLOOKUP($A7,'EKC5'!$P$4:$AB$48,12,FALSE))","v":""},1,null,null,"",1]
["JDB TEAM",{"$f":"IF(ISNA(VLOOKUP($A8,'EKC1'!$P$4:$AB$48,12,FALSE)),\"\",VLOOKUP($A8,'EKC1'!$P$4:$AB$48,12,FALSE))","v":1},{"$f":"IF(ISNA(VLOOKUP($A8,'EKC2'!$P$4:$AB$48,12,FALSE)),\"\",VLOOKUP($A8,'EKC2'!$P$4:$AB$48,12,FALSE))","v":""},{"$f":"IF(ISNA(VLOOKUP($A8,'EKC3'!$P$4:$AB$48,12,FALSE)),\"\",VLOOKUP($A8,'EKC3'!$P$4:$AB$48,12,FALSE))","v":""},{"$f":"IF(ISNA(VLOOKUP($A8,'EKC4'!$P$4:$AB$48,12,FALSE)),\"\",VLOOKUP($A8,'EKC4'!$P$4:$AB$48,12,FALSE))","v":""},{"$f":"IF(ISNA(VLOOKUP($A8,'EKC5'!$P$4:$AB$48,12,FALSE)),\"\",VLOOKUP($A8,'EKC5'!$P$4:$AB$48,12,FALSE))","v":""},1,null,null,"",1]
["JM2 RACING",{"$f":"IF(ISNA(VLOOKUP($A9,'EKC1'!$P$4:$AB$48,12,FALSE)),\"\",VLOOKUP($A9,'EKC1'!$P$4:$AB$48,12,FALSE))","v":1},{"$f":"IF(ISNA(VLOOKUP($A9,'EKC2'!$P$4:$AB$48,12,FALSE)),\"\",VLOOKUP($A9,'EKC2'!$P$4:$AB$48,12,FALSE))","v":""},{"$f":"IF(ISNA(VLOOKUP($A9,'EKC3'!$P$4:$AB$48,12,FALSE)),\"\",VLOOKUP($A9,'EKC3'!$P$4:$AB$48,12,FALSE))","v":""},{"$f":"IF(ISNA(VLOOKUP($A9,'EKC4'!$P$4:$AB$48,12,FALSE)),\"\",VLOOKUP($A9,'EKC4'!$P$4:$AB$48,12,FALSE))","v":""},{"$f":"IF(ISNA(VLOOKUP($A9,'EKC5'!$P$4:$AB$48,12,FALSE)),\"\",VLOOKUP($A9,'EKC5'!$P$4:$AB$48,12,FALSE))","v":""},1,null,null,"",1]
["JOKER TEAM",{"$f":"IF(ISNA(VLOOKUP($A10,'EKC1'!$P$4:$AB$48,12,FALSE)),\"\",VLOOKUP($A10,'EKC1'!$P$4:$AB$48,12,FALSE))","v":1},{"$f":"IF(ISNA(VLOOKUP($A10,'EKC2'!$P$4:$AB$48,12,FALSE)),\"\",VLOOKUP($A10,'EKC2'!$P$4:$AB$48,12,FALSE))","v":""},{"$f":"IF(ISNA(VLOOKUP($A10,'EKC3'!$P$4:$AB$48,12,FALSE)),\"\",VLOOKUP($A10,'EKC3'!$P$4:$AB$48,12,FALSE))","v":""},{"$f":"IF(ISNA(VLOOKUP($A10,'EKC4'!$P$4:$AB$48,12,FALSE)),\"\",VLOOKUP($A10,'EKC4'!$P$4:$AB$48,12,FALSE))","v":""},{"$f":"IF(ISNA(VLOOKUP($A10,'EKC5'!$P$4:$AB$48,12,FALSE)),\"\",VLOOKUP($A10,'EKC5'!$P$4:$AB$48,12,FALSE))","v":""},1,null,null,"",1]
["MACADAM RACING",{"$f":"IF(ISNA(VLOOKUP($A11,'EKC1'!$P$4:$AB$48,12,FALSE)),\"\",VLOOKUP($A11,'EKC1'!$P$4:$AB$48,12,FALSE))","v":1},{"$f":"IF(ISNA(VLOOKUP($A11,'EKC2'!$P$4:$AB$48,12,FALSE)),\"\",VLOOKUP($A11,'EKC2'!$P$4:$AB$48,12,FALSE))","v":""},{"$f":"IF(ISNA(VLOOKUP($A11,'EKC3'!$P$4:$AB$48,12,FALSE)),\"\",VLOOKUP($A11,'EKC3'!$P$4:$AB$48,12,FALSE))","v":""},{"$f":"IF(ISNA(VLOOKUP($A11,'EKC4'!$P$4:$AB$48,12,FALSE)),\"\",VLOOKUP($A11,'EKC4'!$P$4:$AB$48,12,FALSE))","v":""},{"$f":"IF(ISNA(VLOOKUP($A11,'EKC5'!$P$4:$AB$48,12,FALSE)),\"\",VLOOKUP($A11,'EKC5'!$P$4:$AB$48,12,FALSE))","v":""},1,null,null,"",1]
["MECAGAZ",{"$f":"IF(ISNA(VLOOKUP($A12,'EKC1'!$P$4:$AB$48,12,FALSE)),\"\",VLOOKUP($A12,'EKC1'!$P$4:$AB$48,12,FALSE))","v":1},{"$f":"IF(ISNA(VLOOKUP($A12,'EKC2'!$P$4:$AB$48,12,FALSE)),\"\",VLOOKUP($A12,'EKC2'!$P$4:$AB$48,12,FALSE))","v":""},{"$f":"IF(ISNA(VLOOKUP($A12,'EKC3'!$P$4:$AB$48,12,FALSE)),\"\",VLOOKUP($A12,'EKC3'!$P$4:$AB$48,12,FALSE))","v":""},{"$f":"IF(ISNA(VLOOKUP($A12,'EKC4'!$P$4:$AB$48,12,FALSE)),\"\",VLOOKUP($A12,'EKC4'!$P$4:$AB$48,12,FALSE))","v":""},{"$f":"IF(ISNA(VLOOKUP($A12,'EKC5'!$P$4:$AB$48,12,FALSE)),\"\",VLOOKUP($A12,'EKC5'!$P$4:$AB$48,12,FALSE))","v":""},1,null,null,"",1]
["MODAVE MRK PRO",{"$f":"IF(ISNA(VLOOKUP($A13,'EKC1'!$P$4:$AB$48,12,FALSE)),\"\",VLOOKUP($A13,'EKC1'!$P$4:$AB$48,12,FALSE))","v":1},{"$f":"IF(ISNA(VLOOKUP($A13,'EKC2'!$P$4:$AB$48,12,FALSE)),\"\",VLOOKUP($A13,'EKC2'!$P$4:$AB$48,12,FALSE))","v":""},{"$f":"IF(ISNA(VLOOKUP($A13,'EKC3'!$P$4:$AB$48,12,FALSE)),\"\",VLOOKUP($A13,'EKC3'!$P$4:$AB$48,12,FALSE))","v":""},{"$f":"IF(ISNA(VLOOKUP($A13,'EKC4'!$P$4:$AB$48,12,FALSE)),\"\",VLOOKUP($A13,'EKC4'!$P$4:$AB$48,12,FALSE))","v":""},{"$f":"IF(ISNA(VLOOKUP($A13,'EKC5'!$P$4:$AB$48,12,FALSE)),\"\",VLOOKUP($A13,'EKC5'!$P$4:$AB$48,12,FALSE))","v":""},1,null,null,"",1]
["TEAM CAIPI",{"$f":"IF(ISNA(VLOOKUP($A14,'EKC1'!$P$4:$AB$48,12,FALSE)),\"\",VLOOKUP($A14,'EKC1'!$P$4:$AB$48,12,FALSE))","v":1},{"$f":"IF(ISNA(VLOOKUP($A14,'EKC2'!$P$4:$AB$48,12,FALSE)),\"\",VLOOKUP($A14,'EKC2'!$P$4:$AB$48,12,FALSE))","v":""},{"$f":"IF(ISNA(VLOOKUP($A14,'EKC3'!$P$4:$AB$48,12,FALSE)),\"\",VLOOKUP($A14,'EKC3'!$P$4:$AB$48,12,FALSE))","v":""},{"$f":"IF(ISNA(VLOOKUP($A14,'EKC4'!$P$4:$AB$48,12,FALSE)),\"\",VLOOKUP($A14,'EKC4'!$P$4:$AB$48,12,FALSE))","v":""},{"$f":"IF(ISNA(VLOOKUP($A14,'EKC5'!$P$4:$AB$48,12,FALSE)),\"\",VLOOKUP($A14,'EKC5'!$P$4:$AB$48,12,FALSE))","v":""},1,null,null,"",1]
["TEAM ENKART'ON",{"$f":"IF(ISNA(VLOOKUP($A15,'EKC1'!$P$4:$AB$48,12,FALSE)),\"\",VLOOKUP($A15,'EKC1'!$P$4:$AB$48,12,FALSE))","v":1},{"$f":"IF(ISNA(VLOOKUP($A15,'EKC2'!$P$4:$AB$48,12,FALSE)),\"\",VLOOKUP($A15,'EKC2'!$P$4:$AB$48,12,FALSE))","v":""},{"$f":"IF(ISNA(VLOOKUP($A15,'EKC3'!$P$4:$AB$48,12,FALSE)),\"\",VLOOKUP($A15,'EKC3'!$P$4:$AB$48,12,FALSE))","v":""},{"$f":"IF(ISNA(VLOOKUP($A15,'EKC4'!$P$4:$AB$48,12,FALSE)),\"\",VLOOKUP($A15,'EKC4'!$P$4:$AB$48,12,FALSE))","v":""},{"$f":"IF(ISNA(VLOOKUP($A15,'EKC5'!$P$4:$AB$48,12,FALSE)),\"\",VLOOKUP($A15,'EKC5'!$P$4:$AB$48,12,FALSE))","v":""},1,null,null,"",1]
["TEAM RINHA",{"$f":"IF(ISNA(VLOOKUP($A16,'EKC1'!$P$4:$AB$48,12,FALSE)),\"\",VLOOKUP($A16,'EKC1'!$P$4:$AB$48,12,FALSE))","v":1},{"$f":"IF(ISNA(VLOOKUP($A16,'EKC2'!$P$4:$AB$48,12,FALSE)),\"\",VLOOKUP($A16,'EKC2'!$P$4:$AB$48,12,FALSE))","v":""},{"$f":"IF(ISNA(VLOOKUP($A16,'EKC3'!$P$4:$AB$48,12,FALSE)),\"\",VLOOKUP($A16,'EKC3'!$P$4:$AB$48,12,FALSE))","v":""},{"$f":"IF(ISNA(VLOOKUP($A16,'EKC4'!$P$4:$AB$48,12,FALSE)),\"\",VLOOKUP($A16,'EKC4'!$P$4:$AB$48,12,FALSE))","v":""},{"$f":"IF(ISNA(VLOOKUP($A16,'EKC5'!$P$4:$AB$48,12,FALSE)),\"\",VLOOKUP($A16,'EKC5'!$P$4:$AB$48,12,FALSE))","v":""},1,null,null,"",1]
["TEAM TIME PENALTY",{"$f":"IF(ISNA(VLOOKUP($A17,'EKC1'!$P$4:$AB$48,12,FALSE)),\"\",VLOOKUP($A17,'EKC1'!$P$4:$AB$48,12,FALSE))","v":1},{"$f":"IF(ISNA(VLOOKUP($A17,'EKC2'!$P$4:$AB$48,12,FALSE)),\"\",VLOOKUP($A17,'EKC2'!$P$4:$AB$48,12,FALSE))","v":""},{"$f":"IF(ISNA(VLOOKUP($A17,'EKC3'!$P$4:$AB$48,12,FALSE)),\"\",VLOOKUP($A17,'EKC3'!$P$4:$AB$48,12,FALSE))","v":""},{"$f":"IF(ISNA(VLOOKUP($A17,'EKC4'!$P$4:$AB$48,12,FALSE)),\"\",VLOOKUP($A17,'EKC4'!$P$4:$AB$48,12,FALSE))","v":""},{"$f":"IF(ISNA(VLOOKUP($A17,'EKC5'!$P$4:$AB$48,12,FALSE)),\"\",VLOOKUP($A17,'EKC5'!$P$4:$AB$48,12,FALSE))","v":""},1,null,null,"",1]
["THALES 1",{"$f":"IF(ISNA(VLOOKUP($A18,'EKC1'!$P$4:$AB$48,12,FALSE)),\"\",VLOOKUP($A18,'EKC1'!$P$4:$AB$48,12,FALSE))","v":1},{"$f":"IF(ISNA(VLOOKUP($A18,'EKC2'!$P$4:$AB$48,12,FALSE)),\"\",VLOOKUP($A18,'EKC2'!$P$4:$AB$48,12,FALSE))","v":""},{"$f":"IF(ISNA(VLOOKUP($A18,'EKC3'!$P$4:$AB$48,12,FALSE)),\"\",VLOOKUP($A18,'EKC3'!$P$4:$AB$48,12,FALSE))","v":""},{"$f":"IF(ISNA(VLOOKUP($A18,'EKC4'!$P$4:$AB$48,12,FALSE)),\"\",VLOOKUP($A18,'EKC4'!$P$4:$AB$48,12,FALSE))","v":""},{"$f":"IF(ISNA(VLOOKUP($A18,'EKC5'!$P$4:$AB$48,12,FALSE)),\"\",VLOOKUP($A18,'EKC5'!$P$4:$AB$48,12,FALSE))","v":""},1,null,null,"",0]
[null,{"$f":"IF(ISNA(VLOOKUP($A19,'EKC1'!$P$4:$AB$48,12,FALSE)),\"\",VLOOKUP($A19,'EKC1'!$P$4:$AB$48,12,FALSE))","v":""},{"$f":"IF(ISNA(VLOOKUP($A19,'EKC2'!$P$4:$AB$48,12,FALSE)),\"\",VLOOKUP($A19,'EKC2'!$P$4:$AB$48,12,FALSE))","v":""},{"$f":"IF(ISNA(VLOOKUP($A19,'EKC3'!$P$4:$AB$48,12,FALSE)),\"\",VLOOKUP($A19,'EKC3'!$P$4:$AB$48,12,FALSE))","v":""},{"$f":"IF(ISNA(VLOOKUP($A19,'EKC4'!$P$4:$AB$48,12,FALSE)),\"\",VLOOKUP($A19,'EKC4'!$P$4:$AB$48,12,FALSE))","v":""},{"$f":"IF(ISNA(VLOOKUP($A19,'EKC5'!$P$4:$AB$48,12,FALSE)),\"\",VLOOKUP($A19,'EKC5'!$P$4:$AB$48,12,FALSE))","v":""},0,null,null,"",0]
[null,{"$f":"IF(ISNA(VLOOKUP($A20,'EKC1'!$P$4:$AB$48,12,FALSE)),\"\",VLOOKUP($A20,'EKC1'!$P$4:$AB$48,12,FALSE))","v":""},{"$f":"IF(ISNA(VLOOKUP($A20,'EKC2'!$P$4:$AB$48,12,FALSE)),\"\",VLOOKUP($A20,'EKC2'!$P$4:$AB$48,12,FALSE))","v":""},{"$f":"IF(ISNA(VLOOKUP($A20,'EKC3'!$P$4:$AB$48,12,FALSE)),\"\",VLOOKUP($A20,'EKC3'!$P$4:$AB$48,12,FALSE))","v":""},{"$f":"IF(ISNA(VLOOKUP($A20,'EKC4'!$P$4:$AB$48,12,FALSE)),\"\",VLOOKUP($A20,'EKC4'!$P$4:$AB$48,12,FALSE))","v":""},{"$f":"IF(ISNA(VLOOKUP($A20,'EKC5'!$P$4:$AB$48,12,FALSE)),\"\",VLOOKUP($A20,'EKC5'!$P$4:$AB$48,12,FALSE))","v":""},0,null,null,"",0]
[null,{"$f":"IF(ISNA(VLOOKUP($A21,'EKC1'!$P$4:$AB$48,12,FALSE)),\"\",VLOOKUP($A21,'EKC1'!$P$4:$AB$48,12,FALSE))","v":""},{"$f":"IF(ISNA(VLOOKUP($A21,'EKC2'!$P$4:$AB$48,12,FALSE)),\"\",VLOOKUP($A21,'EKC2'!$P$4:$AB$48,12,FALSE))","v":""},{"$f":"IF(ISNA(VLOOKUP($A21,'EKC3'!$P$4:$AB$48,12,FALSE)),\"\",VLOOKUP($A21,'EKC3'!$P$4:$AB$48,12,FALSE))","v":""},{"$f":"IF(ISNA(VLOOKUP($A21,'EKC4'!$P$4:$AB$48,12,FALSE)),\"\",VLOOKUP($A21,'EKC4'!$P$4:$AB$48,12,FALSE))","v":""},{"$f":"IF(ISNA(VLOOKUP($A21,'EKC5'!$P$4:$AB$48,12,FALSE)),\"\",VLOOKUP($A21,'EKC5'!$P$4:$AB$48,12,FALSE))","v":""},0,null,null,"",0]
[null,{"$f":"IF(ISNA(VLOOKUP($A22,'EKC1'!$P$4:$AB$48,12,FALSE)),\"\",VLOOKUP($A22,'EKC1'!$P$4:$AB$48,12,FALSE))","v":""},{"$f":"IF(ISNA(VLOOKUP($A22,'EKC2'!$P$4:$AB$48,12,FALSE)),\"\",VLOOKUP($A22,'EKC2'!$P$4:$AB$48,12,FALSE))","v":""},{"$f":"IF(ISNA(VLOOKUP($A22,'EKC3'!$P$4:$AB$48,12,FALSE)),\"\",VLOOKUP($A22,'EKC3'!$P$4:$AB$48,12,FALSE))","v":""},{"$f":"IF(ISNA(VLOOKUP($A22,'EKC4'!$P$4:$AB$48,12,FALSE)),\"\",VLOOKUP($A22,'EKC4'!$P$4:$AB$48,12,FALSE))","v":""},{"$f":"IF(ISNA(VLOOKUP($A22,'EKC5'!$P$4:$AB$48,12,FALSE)),\"\",VLOOKUP($A22,'EKC5'!$P$4:$AB$48,12,FALSE))","v":""},0,null,null,"",0]
[null,{"$f":"IF(ISNA(VLOOKUP($A23,'EKC1'!$P$4:$AB$48,12,FALSE)),\"\",VLOOKUP($A23,'EKC1'!$P$4:$AB$48,12,FALSE))","v":""},{"$f":"IF(ISNA(VLOOKUP($A23,'EKC2'!$P$4:$AB$48,12,FALSE)),\"\",VLOOKUP($A23,'EKC2'!$P$4:$AB$48,12,FALSE))","v":""},{"$f":"IF(ISNA(VLOOKUP($A23,'EKC3'!$P$4:$AB$48,12,FALSE)),\"\",VLOOKUP($A23,'EKC3'!$P$4:$AB$48,12,FALSE))","v":""},{"$f":"IF(ISNA(VLOOKUP($A23,'EKC4'!$P$4:$AB$48,12,FALSE)),\"\",VLOOKUP($A23,'EKC4'!$P$4:$AB$48,12,FALSE))","v":""},{"$f":"IF(ISNA(VLOOKUP($A23,'EKC5'!$P$4:$AB$48,12,FALSE)),\"\",VLOOKUP($A23,'EKC5'!$P$4:$AB$48,12,FALSE))","v":""},0,null,null,"",0]
[null,{"$f":"IF(ISNA(VLOOKUP($A24,'EKC1'!$P$4:$AB$48,12,FALSE)),\"\",VLOOKUP($A24,'EKC1'!$P$4:$AB$48,12,FALSE))","v":""},{"$f":"IF(ISNA(VLOOKUP($A24,'EKC2'!$P$4:$AB$48,12,FALSE)),\"\",VLOOKUP($A24,'EKC2'!$P$4:$AB$48,12,FALSE))","v":""},{"$f":"IF(ISNA(VLOOKUP($A24,'EKC3'!$P$4:$AB$48,12,FALSE)),\"\",VLOOKUP($A24,'EKC3'!$P$4:$AB$48,12,FALSE))","v":""},{"$f":"IF(ISNA(VLOOKUP($A24,'EKC4'!$P$4:$AB$48,12,FALSE)),\"\",VLOOKUP($A24,'EKC4'!$P$4:$AB$48,12,FALSE))","v":""},{"$f":"IF(ISNA(VLOOKUP($A24,'EKC5'!$P$4:$AB$48,12,FALSE)),\"\",VLOOKUP($A24,'EKC5'!$P$4:$AB$48,12,FALSE))","v":""},0,null,null,"",0]
[null,{"$f":"IF(ISNA(VLOOKUP($A25,'EKC1'!$P$4:$AB$48,12,FALSE)),\"\",VLOOKUP($A25,'EKC1'!$P$4:$AB$48,12,FALSE))","v":""},{"$f":"IF(ISNA(VLOOKUP($A25,'EKC2'!$P$4:$AB$48,12,FALSE)),\"\",VLOOKUP($A25,'EKC2'!$P$4:$AB$48,12,FALSE))","v":""},{"$f":"IF(ISNA(VLOOKUP($A25,'EKC3'!$P$4:$AB$48,12,FALSE)),\"\",VLOOKUP($A25,'EKC3'!$P$4:$AB$48,12,FALSE))","v":""},{"$f":"IF(ISNA(VLOOKUP($A25,'EKC4'!$P$4:$AB$48,12,FALSE)),\"\",VLOOKUP($A25,'EKC4'!$P$4:$AB$48,12,FALSE))","v":""},{"$f":"IF(ISNA(VLOOKUP($A25,'EKC5'!$P$4:$AB$48,12,FALSE)),\"\",VLOOKUP($A25,'EKC5'!$P$4:$AB$48,12,FALSE))","v":""},0,null,null,"",0]
[null,{"$f":"IF(ISNA(VLOOKUP($A26,'EKC1'!$P$4:$AB$48,12,FALSE)),\"\",VLOOKUP($A26,'EKC1'!$P$4:$AB$48,12,FALSE))","v":""},{"$f":"IF(ISNA(VLOOKUP($A26,'EKC2'!$P$4:$AB$48,12,FALSE)),\"\",VLOOKUP($A26,'EKC2'!$P$4:$AB$48,12,FALSE))","v":""},{"$f":"IF(ISNA(VLOOKUP($A26,'EKC3'!$P$4:$AB$48,12,FALSE)),\"\",VLOOKUP($A26,'EKC3'!$P$4:$AB$48,12,FALSE))","v":""},{"$f":"IF(ISNA(VLOOKUP($A26,'EKC4'!$P$4:$AB$48,12,FALSE)),\"\",VLOOKUP($A26,'EKC4'!$P$4:$AB$48,12,FALSE))","v":""},{"$f":"IF(ISNA(VLOOKUP($A26,'EKC5'!$P$4:$AB$48,12,FALSE)),\"\",VLOOKUP($A26,'EKC5'!$P$4:$AB$48,12,FALSE))","v":""},0,null,null,"",0]
[null,{"$f":"IF(ISNA(VLOOKUP($A27,'EKC1'!$P$4:$AB$48,12,FALSE)),\"\",VLOOKUP($A27,'EKC1'!$P$4:$AB$48,12,FALSE))","v":""},{"$f":"IF(ISNA(VLOOKUP($A27,'EKC2'!$P$4:$AB$48,12,FALSE)),\"\",VLOOKUP($A27,'EKC2'!$P$4:$AB$48,12,FALSE))","v":""},{"$f":"IF(ISNA(VLOOKUP($A27,'EKC3'!$P$4:$AB$48,12,FALSE)),\"\",VLOOKUP($A27,'EKC3'!$P$4:$AB$48,12,FALSE))","v":""},{"$f":"IF(ISNA(VLOOKUP($A27,'EKC4'!$P$4:$AB$48,12,FALSE)),\"\",VLOOKUP($A27,'EKC4'!$P$4:$AB$48,12,FALSE))","v":""},{"$f":"IF(ISNA(VLOOKUP($A27,'EKC5'!$P$4:$AB$48,12,FALSE)),\"\",VLOOKUP($A27,'EKC5'!$P$4:$AB$48,12,FALSE))","v":""},0,null,null,"",0]
[null,{"$f":"IF(ISNA(VLOOKUP($A28,'EKC1'!$P$4:$AB$48,12,FALSE)),\"\",VLOOKUP($A28,'EKC1'!$P$4:$AB$48,12,FALSE))","v":""},{"$f":"IF(ISNA(VLOOKUP($A28,'EKC2'!$P$4:$AB$48,12,FALSE)),\"\",VLOOKUP($A28,'EKC2'!$P$4:$AB$48,12,FALSE))","v":""},{"$f":"IF(ISNA(VLOOKUP($A28,'EKC3'!$P$4:$AB$48,12,FALSE)),\"\",VLOOKUP($A28,'EKC3'!$P$4:$AB$48,12,FALSE))","v":""},{"$f":"IF(ISNA(VLOOKUP($A28,'EKC4'!$P$4:$AB$48,12,FALSE)),\"\",VLOOKUP($A28,'EKC4'!$P$4:$AB$48,12,FALSE))","v":""},{"$f":"IF(ISNA(VLOOKUP($A28,'EKC5'!$P$4:$AB$48,12,FALSE)),\"\",VLOOKUP($A28,'EKC5'!$P$4:$AB$48,12,FALSE))","v":""},0,null,null,"",0]
[null,{"$f":"IF(ISNA(VLOOKUP($A29,'EKC1'!$P$4:$AB$48,12,FALSE)),\"\",VLOOKUP($A29,'EKC1'!$P$4:$AB$48,12,FALSE))","v":""},{"$f":"IF(ISNA(VLOOKUP($A29,'EKC2'!$P$4:$AB$48,12,FALSE)),\"\",VLOOKUP($A29,'EKC2'!$P$4:$AB$48,12,FALSE))","v":""},{"$f":"IF(ISNA(VLOOKUP($A29,'EKC3'!$P$4:$AB$48,12,FALSE)),\"\",VLOOKUP($A29,'EKC3'!$P$4:$AB$48,12,FALSE))","v":""},{"$f":"IF(ISNA(VLOOKUP($A29,'EKC4'!$P$4:$AB$48,12,FALSE)),\"\",VLOOKUP($A29,'EKC4'!$P$4:$AB$48,12,FALSE))","v":""},{"$f":"IF(ISNA(VLOOKUP($A29,'EKC5'!$P$4:$AB$48,12,FALSE)),\"\",VLOOKUP($A29,'EKC5'!$P$4:$AB$48,12,FALSE))","v":""},0,null,null,"",0]
[null,{"$f":"IF(ISNA(VLOOKUP($A30,'EKC1'!$P$4:$AB$48,12,FALSE)),\"\",VLOOKUP($A30,'EKC1'!$P$4:$AB$48,12,FALSE))","v":""},{"$f":"IF(ISNA(VLOOKUP($A30,'EKC2'!$P$4:$AB$48,12,FALSE)),\"\",VLOOKUP($A30,'EKC2'!$P$4:$AB$48,12,FALSE))","v":""},{"$f":"IF(ISNA(VLOOKUP($A30,'EKC3'!$P$4:$AB$48,12,FALSE)),\"\",VLOOKUP($A30,'EKC3'!$P$4:$AB$48,12,FALSE))","v":""},{"$f":"IF(ISNA(VLOOKUP($A30,'EKC4'!$P$4:$AB$48,12,FALSE)),\"\",VLOOKUP($A30,'EKC4'!$P$4:$AB$48,12,FALSE))","v":""},{"$f":"IF(ISNA(VLOOKUP($A30,'EKC5'!$P$4:$AB$48,12,FALSE)),\"\",VLOOKUP($A30,'EKC5'!$P$4:$AB$48,12,FALSE))","v":""},0,null,null,"",0]
[null,{"$f":"IF(ISNA(VLOOKUP($A31,'EKC1'!$P$4:$AB$48,12,FALSE)),\"\",VLOOKUP($A31,'EKC1'!$P$4:$AB$48,12,FALSE))","v":""},{"$f":"IF(ISNA(VLOOKUP($A31,'EKC2'!$P$4:$AB$48,12,FALSE)),\"\",VLOOKUP($A31,'EKC2'!$P$4:$AB$48,12,FALSE))","v":""},{"$f":"IF(ISNA(VLOOKUP($A31,'EKC3'!$P$4:$AB$48,12,FALSE)),\"\",VLOOKUP($A31,'EKC3'!$P$4:$AB$48,12,FALSE))","v":""},{"$f":"IF(ISNA(VLOOKUP($A31,'EKC4'!$P$4:$AB$48,12,FALSE)),\"\",VLOOKUP($A31,'EKC4'!$P$4:$AB$48,12,FALSE))","v":""},{"$f":"IF(ISNA(VLOOKUP($A31,'EKC5'!$P$4:$AB$48,12,FALSE)),\"\",VLOOKUP($A31,'EKC5'!$P$4:$AB$48,12,FALSE))","v":""},0,null,null,"",0]
[null,{"$f":"IF(ISNA(VLOOKUP($A32,'EKC1'!$P$4:$AB$48,12,FALSE)),\"\",VLOOKUP($A32,'EKC1'!$P$4:$AB$48,12,FALSE))","v":""},{"$f":"IF(ISNA(VLOOKUP($A32,'EKC2'!$P$4:$AB$48,12,FALSE)),\"\",VLOOKUP($A32,'EKC2'!$P$4:$AB$48,12,FALSE))","v":""},{"$f":"IF(ISNA(VLOOKUP($A32,'EKC3'!$P$4:$AB$48,12,FALSE)),\"\",VLOOKUP($A32,'EKC3'!$P$4:$AB$48,12,FALSE))","v":""},{"$f":"IF(ISNA(VLOOKUP($A32,'EKC4'!$P$4:$AB$48,12,FALSE)),\"\",VLOOKUP($A32,'EKC4'!$P$4:$AB$48,12,FALSE))","v":""},{"$f":"IF(ISNA(VLOOKUP($A32,'EKC5'!$P$4:$AB$48,12,FALSE)),\"\",VLOOKUP($A32,'EKC5'!$P$4:$AB$48,12,FALSE))","v":""},0,null,null,"",0]
[null,{"$f":"IF(ISNA(VLOOKUP($A33,'EKC1'!$P$4:$AB$48,12,FALSE)),\"\",VLOOKUP($A33,'EKC1'!$P$4:$AB$48,12,FALSE))","v":""},{"$f":"IF(ISNA(VLOOKUP($A33,'EKC2'!$P$4:$AB$48,12,FALSE)),\"\",VLOOKUP($A33,'EKC2'!$P$4:$AB$48,12,FALSE))","v":""},{"$f":"IF(ISNA(VLOOKUP($A33,'EKC3'!$P$4:$AB$48,12,FALSE)),\"\",VLOOKUP($A33,'EKC3'!$P$4:$AB$48,12,FALSE))","v":""},{"$f":"IF(ISNA(VLOOKUP($A33,'EKC4'!$P$4:$AB$48,12,FALSE)),\"\",VLOOKUP($A33,'EKC4'!$P$4:$AB$48,12,FALSE))","v":""},{"$f":"IF(ISNA(VLOOKUP($A33,'EKC5'!$P$4:$AB$48,12,FALSE)),\"\",VLOOKUP($A33,'EKC5'!$P$4:$AB$48,12,FALSE))","v":""},0,null,null,"",0]
[null,{"$f":"IF(ISNA(VLOOKUP($A34,'EKC1'!$P$4:$AB$48,12,FALSE)),\"\",VLOOKUP($A34,'EKC1'!$P$4:$AB$48,12,FALSE))","v":""},{"$f":"IF(ISNA(VLOOKUP($A34,'EKC2'!$P$4:$AB$48,12,FALSE)),\"\",VLOOKUP($A34,'EKC2'!$P$4:$AB$48,12,FALSE))","v":""},{"$f":"IF(ISNA(VLOOKUP($A34,'EKC3'!$P$4:$AB$48,12,FALSE)),\"\",VLOOKUP($A34,'EKC3'!$P$4:$AB$48,12,FALSE))","v":""},{"$f":"IF(ISNA(VLOOKUP($A34,'EKC4'!$P$4:$AB$48,12,FALSE)),\"\",VLOOKUP($A34,'EKC4'!$P$4:$AB$48,12,FALSE))","v":""},{"$f":"IF(ISNA(VLOOKUP($A34,'EKC5'!$P$4:$AB$48,12,FALSE)),\"\",VLOOKUP($A34,'EKC5'!$P$4:$AB$48,12,FALSE))","v":""},0,null,null,"",0]
[null,{"$f":"IF(ISNA(VLOOKUP($A35,'EKC1'!$P$4:$AB$48,12,FALSE)),\"\",VLOOKUP($A35,'EKC1'!$P$4:$AB$48,12,FALSE))","v":""},{"$f":"IF(ISNA(VLOOKUP($A35,'EKC2'!$P$4:$AB$48,12,FALSE)),\"\",VLOOKUP($A35,'EKC2'!$P$4:$AB$48,12,FALSE))","v":""},{"$f":"IF(ISNA(VLOOKUP($A35,'EKC3'!$P$4:$AB$48,12,FALSE)),\"\",VLOOKUP($A35,'EKC3'!$P$4:$AB$48,12,FALSE))","v":""},{"$f":"IF(ISNA(VLOOKUP($A35,'EKC4'!$P$4:$AB$48,12,FALSE)),\"\",VLOOKUP($A35,'EKC4'!$P$4:$AB$48,12,FALSE))","v":""},{"$f":"IF(ISNA(VLOOKUP($A35,'EKC5'!$P$4:$AB$48,12,FALSE)),\"\",VLOOKUP($A35,'EKC5'!$P$4:$AB$48,12,FALSE))","v":""},0,null,null,"",0]
[null,{"$f":"IF(ISNA(VLOOKUP($A36,'EKC1'!$P$4:$AB$48,12,FALSE)),\"\",VLOOKUP($A36,'EKC1'!$P$4:$AB$48,12,FALSE))","v":""},{"$f":"IF(ISNA(VLOOKUP($A36,'EKC2'!$P$4:$AB$48,12,FALSE)),\"\",VLOOKUP($A36,'EKC2'!$P$4:$AB$48,12,FALSE))","v":""},{"$f":"IF(ISNA(VLOOKUP($A36,'EKC3'!$P$4:$AB$48,12,FALSE)),\"\",VLOOKUP($A36,'EKC3'!$P$4:$AB$48,12,FALSE))","v":""},{"$f":"IF(ISNA(VLOOKUP($A36,'EKC4'!$P$4:$AB$48,12,FALSE)),\"\",VLOOKUP($A36,'EKC4'!$P$4:$AB$48,12,FALSE))","v":""},{"$f":"IF(ISNA(VLOOKUP($A36,'EKC5'!$P$4:$AB$48,12,FALSE)),\"\",VLOOKUP($A36,'EKC5'!$P$4:$AB$48,12,FALSE))","v":""},0,null,null,"",0]
[null,{"$f":"IF(ISNA(VLOOKUP($A37,'EKC1'!$P$4:$AB$48,12,FALSE)),\"\",VLOOKUP($A37,'EKC1'!$P$4:$AB$48,12,FALSE))","v":""},{"$f":"IF(ISNA(VLOOKUP($A37,'EKC2'!$P$4:$AB$48,12,FALSE)),\"\",VLOOKUP($A37,'EKC2'!$P$4:$AB$48,12,FALSE))","v":""},{"$f":"IF(ISNA(VLOOKUP($A37,'EKC3'!$P$4:$AB$48,12,FALSE)),\"\",VLOOKUP($A37,'EKC3'!$P$4:$AB$48,12,FALSE))","v":""},{"$f":"IF(ISNA(VLOOKUP($A37,'EKC4'!$P$4:$AB$48,12,FALSE)),\"\",VLOOKUP($A37,'EKC4'!$P$4:$AB$48,12,FALSE))","v":""},{"$f":"IF(ISNA(VLOOKUP($A37,'EKC5'!$P$4:$AB$48,12,FALSE)),\"\",VLOOKUP($A37,'EKC5'!$P$4:$AB$48,12,FALSE))","v":""},0,null,null,"",0]
[null,{"$f":"IF(ISNA(VLOOKUP($A38,'EKC1'!$P$4:$AB$48,12,FALSE)),\"\",VLOOKUP($A38,'EKC1'!$P$4:$AB$48,12,FALSE))","v":""},{"$f":"IF(ISNA(VLOOKUP($A38,'EKC2'!$P$4:$AB$48,12,FALSE)),\"\",VLOOKUP($A38,'EKC2'!$P$4:$AB$48,12,FALSE))","v":""},{"$f":"IF(ISNA(VLOOKUP($A38,'EKC3'!$P$4:$AB$48,12,FALSE)),\"\",VLOOKUP($A38,'EKC3'!$P$4:$AB$48,12,FALSE))","v":""},{"$f":"IF(ISNA(VLOOKUP($A38,'EKC4'!$P$4:$AB$48,12,FALSE)),\"\",VLOOKUP($A38,'EKC4'!$P$4:$AB$48,12,FALSE))","v":""},{"$f":"IF(ISNA(VLOOKUP($A38,'EKC5'!$P$4:$AB$48,12,FALSE)),\"\",VLOOKUP($A38,'EKC5'!$P$4:$AB$48,12,FALSE))","v":""},0,null,null,"",0]
[null,{"$f":"IF(ISNA(VLOOKUP($A39,'EKC1'!$P$4:$AB$48,12,FALSE)),\"\",VLOOKUP($A39,'EKC1'!$P$4:$AB$48,12,FALSE))","v":""},{"$f":"IF(ISNA(VLOOKUP($A39,'EKC2'!$P$4:$AB$48,12,FALSE)),\"\",VLOOKUP($A39,'EKC2'!$P$4:$AB$48,12,FALSE))","v":""},{"$f":"IF(ISNA(VLOOKUP($A39,'EKC3'!$P$4:$AB$48,12,FALSE)),\"\",VLOOKUP($A39,'EKC3'!$P$4:$AB$48,12,FALSE))","v":""},{"$f":"IF(ISNA(VLOOKUP($A39,'EKC4'!$P$4:$AB$48,12,FALSE)),\"\",VLOOKUP($A39,'EKC4'!$P$4:$AB$48,12,FALSE))","v":""},{"$f":"IF(ISNA(VLOOKUP($A39,'EKC5'!$P$4:$AB$48,12,FALSE)),\"\",VLOOKUP($A39,'EKC5'!$P$4:$AB$48,12,FALSE))","v":""},0,null,null,"",0]
[null,{"$f":"IF(ISNA(VLOOKUP($A40,'EKC1'!$P$4:$AB$48,12,FALSE)),\"\",VLOOKUP($A40,'EKC1'!$P$4:$AB$48,12,FALSE))","v":""},{"$f":"IF(ISNA(VLOOKUP($A40,'EKC2'!$P$4:$AB$48,12,FALSE)),\"\",VLOOKUP($A40,'EKC2'!$P$4:$AB$48,12,FALSE))","v":""},{"$f":"IF(ISNA(VLOOKUP($A40,'EKC3'!$P$4:$AB$48,12,FALSE)),\"\",VLOOKUP($A40,'EKC3'!$P$4:$AB$48,12,FALSE))","v":""},{"$f":"IF(ISNA(VLOOKUP($A40,'EKC4'!$P$4:$AB$48,12,FALSE)),\"\",VLOOKUP($A40,'EKC4'!$P$4:$AB$48,12,FALSE))","v":""},{"$f":"IF(ISNA(VLOOKUP($A40,'EKC5'!$P$4:$AB$48,12,FALSE)),\"\",VLOOKUP($A40,'EKC5'!$P$4:$AB$48,12,FALSE))","v":""},0,null,null,"",0]
[null,{"$f":"IF(ISNA(VLOOKUP($A41,'EKC1'!$P$4:$AB$48,12,FALSE)),\"\",VLOOKUP($A41,'EKC1'!$P$4:$AB$48,12,FALSE))","v":""},{"$f":"IF(ISNA(VLOOKUP($A41,'EKC2'!$P$4:$AB$48,12,FALSE)),\"\",VLOOKUP($A41,'EKC2'!$P$4:$AB$48,12,FALSE))","v":""},{"$f":"IF(ISNA(VLOOKUP($A41,'EKC3'!$P$4:$AB$48,12,FALSE)),\"\",VLOOKUP($A41,'EKC3'!$P$4:$AB$48,12,FALSE))","v":""},{"$f":"IF(ISNA(VLOOKUP($A41,'EKC4'!$P$4:$AB$48,12,FALSE)),\"\",VLOOKUP($A41,'EKC4'!$P$4:$AB$48,12,FALSE))","v":""},{"$f":"IF(ISNA(VLOOKUP($A41,'EKC5'!$P$4:$AB$48,12,FALSE)),\"\",VLOOKUP($A41,'EKC5'!$P$4:$AB$48,12,FALSE))","v":""},0,null,null,"",0]
[null,{"$f":"IF(ISNA(VLOOKUP($A42,'EKC1'!$P$4:$AB$48,12,FALSE)),\"\",VLOOKUP($A42,'EKC1'!$P$4:$AB$48,12,FALSE))","v":""},{"$f":"IF(ISNA(VLOOKUP($A42,'EKC2'!$P$4:$AB$48,12,FALSE)),\"\",VLOOKUP($A42,'EKC2'!$P$4:$AB$48,12,FALSE))","v":""},{"$f":"IF(ISNA(VLOOKUP($A42,'EKC3'!$P$4:$AB$48,12,FALSE)),\"\",VLOOKUP($A42,'EKC3'!$P$4:$AB$48,12,FALSE))","v":""},{"$f":"IF(ISNA(VLOOKUP($A42,'EKC4'!$P$4:$AB$48,12,FALSE)),\"\",VLOOKUP($A42,'EKC4'!$P$4:$AB$48,12,FALSE))","v":""},{"$f":"IF(ISNA(VLOOKUP($A42,'EKC5'!$P$4:$AB$48,12,FALSE)),\"\",VLOOKUP($A42,'EKC5'!$P$4:$AB$48,12,FALSE))","v":""},0,null,null,"",0]
[null,{"$f":"IF(ISNA(VLOOKUP($A43,'EKC1'!$P$4:$AB$48,12,FALSE)),\"\",VLOOKUP($A43,'EKC1'!$P$4:$AB$48,12,FALSE))","v":""},{"$f":"IF(ISNA(VLOOKUP($A43,'EKC2'!$P$4:$AB$48,12,FALSE)),\"\",VLOOKUP($A43,'EKC2'!$P$4:$AB$48,12,FALSE))","v":""},{"$f":"IF(ISNA(VLOOKUP($A43,'EKC3'!$P$4:$AB$48,12,FALSE)),\"\",VLOOKUP($A43,'EKC3'!$P$4:$AB$48,12,FALSE))","v":""},{"$f":"IF(ISNA(VLOOKUP($A43,'EKC4'!$P$4:$AB$48,12,FALSE)),\"\",VLOOKUP($A43,'EKC4'!$P$4:$AB$48,12,FALSE))","v":""},{"$f":"IF(ISNA(VLOOKUP($A43,'EKC5'!$P$4:$AB$48,12,FALSE)),\"\",VLOOKUP($A43,'EKC5'!$P$4:$AB$48,12,FALSE))","v":""},0,null,null,"",0]
[null,{"$f":"IF(ISNA(VLOOKUP($A44,'EKC1'!$P$4:$AB$48,12,FALSE)),\"\",VLOOKUP($A44,'EKC1'!$P$4:$AB$48,12,FALSE))","v":""},{"$f":"IF(ISNA(VLOOKUP($A44,'EKC2'!$P$4:$AB$48,12,FALSE)),\"\",VLOOKUP($A44,'EKC2'!$P$4:$AB$48,12,FALSE))","v":""},{"$f":"IF(ISNA(VLOOKUP($A44,'EKC3'!$P$4:$AB$48,12,FALSE)),\"\",VLOOKUP($A44,'EKC3'!$P$4:$AB$48,12,FALSE))","v":""},{"$f":"IF(ISNA(VLOOKUP($A44,'EKC4'!$P$4:$AB$48,12,FALSE)),\"\",VLOOKUP($A44,'EKC4'!$P$4:$AB$48,12,FALSE))","v":""},{"$f":"IF(ISNA(VLOOKUP($A44,'EKC5'!$P$4:$AB$48,12,FALSE)),\"\",VLOOKUP($A44,'EKC5'!$P$4:$AB$48,12,FALSE))","v":""},0,null,null,"",0]
[null,{"$f":"IF(ISNA(VLOOKUP($A45,'EKC1'!$P$4:$AB$48,12,FALSE)),\"\",VLOOKUP($A45,'EKC1'!$P$4:$AB$48,12,FALSE))","v":""},{"$f":"IF(ISNA(VLOOKUP($A45,'EKC2'!$P$4:$AB$48,12,FALSE)),\"\",VLOOKUP($A45,'EKC2'!$P$4:$AB$48,12,FALSE))","v":""},{"$f":"IF(ISNA(VLOOKUP($A45,'EKC3'!$P$4:$AB$48,12,FALSE)),\"\",VLOOKUP($A45,'EKC3'!$P$4:$AB$48,12,FALSE))","v":""},{"$f":"IF(ISNA(VLOOKUP($A45,'EKC4'!$P$4:$AB$48,12,FALSE)),\"\",VLOOKUP($A45,'EKC4'!$P$4:$AB$48,12,FALSE))","v":""},{"$f":"IF(ISNA(VLOOKUP($A45,'EKC5'!$P$4:$AB$48,12,FALSE)),\"\",VLOOKUP($A45,'EKC5'!$P$4:$AB$48,12,FALSE))","v":""},0,null,null,"",0]
[null,{"$f":"IF(ISNA(VLOOKUP($A46,'EKC1'!$P$4:$AB$48,12,FALSE)),\"\",VLOOKUP($A46,'EKC1'!$P$4:$AB$48,12,FALSE))","v":""},{"$f":"IF(ISNA(VLOOKUP($A46,'EKC2'!$P$4:$AB$48,12,FALSE)),\"\",VLOOKUP($A46,'EKC2'!$P$4:$AB$48,12,FALSE))","v":""},{"$f":"IF(ISNA(VLOOKUP($A46,'EKC3'!$P$4:$AB$48,12,FALSE)),\"\",VLOOKUP($A46,'EKC3'!$P$4:$AB$48,12,FALSE))","v":""},{"$f":"IF(ISNA(VLOOKUP($A46,'EKC4'!$P$4:$AB$48,12,FALSE)),\"\",VLOOKUP($A46,'EKC4'!$P$4:$AB$48,12,FALSE))","v":""},{"$f":"IF(ISNA(VLOOKUP($A46,'EKC5'!$P$4:$AB$48,12,FALSE)),\"\",VLOOKUP($A46,'EKC5'!$P$4:$AB$48,12,FALSE))","v":""},0,null,null,"",0]
[null,{"$f":"IF(ISNA(VLOOKUP($A47,'EKC1'!$P$4:$AB$48,12,FALSE)),\"\",VLOOKUP($A47,'EKC1'!$P$4:$AB$48,12,FALSE))","v":""},{"$f":"IF(ISNA(VLOOKUP($A47,'EKC2'!$P$4:$AB$48,12,FALSE)),\"\",VLOOKUP($A47,'EKC2'!$P$4:$AB$48,12,FALSE))","v":""},{"$f":"IF(ISNA(VLOOKUP($A47,'EKC3'!$P$4:$AB$48,12,FALSE)),\"\",VLOOKUP($A47,'EKC3'!$P$4:$AB$48,12,FALSE))","v":""},{"$f":"IF(ISNA(VLOOKUP($A47,'EKC4'!$P$4:$AB$48,12,FALSE)),\"\",VLOOKUP($A47,'EKC4'!$P$4:$AB$48,12,FALSE))","v":""},{"$f":"IF(ISNA(VLOOKUP($A47,'EKC5'!$P$4:$AB$48,12,FALSE)),\"\",VLOOKUP($A47,'EKC5'!$P$4:$AB$48,12,FALSE))","v":""},0,null,null,"",0]
[null,{"$f":"IF(ISNA(VLOOKUP($A48,'EKC1'!$P$4:$AB$48,12,FALSE)),\"\",VLOOKUP($A48,'EKC1'!$P$4:$AB$48,12,FALSE))","v":""},{"$f":"IF(ISNA(VLOOKUP($A48,'EKC2'!$P$4:$AB$48,12,FALSE)),\"\",VLOOKUP($A48,'EKC2'!$P$4:$AB$48,12,FALSE))","v":""},{"$f":"IF(ISNA(VLOOKUP($A48,'EKC3'!$P$4:$AB$48,12,FALSE)),\"\",VLOOKUP($A48,'EKC3'!$P$4:$AB$48,12,FALSE))","v":""},{"$f":"IF(ISNA(VLOOKUP($A48,'EKC4'!$P$4:$AB$48,12,FALSE)),\"\",VLOOKUP($A48,'EKC4'!$P$4:$AB$48,12,FALSE))","v":""},{"$f":"IF(ISNA(VLOOKUP($A48,'EKC5'!$P$4:$AB$48,12,FALSE)),\"\",VLOOKUP($A48,'EKC5'!$P$4:$AB$48,12,FALSE))","v":""},0,null,null,"",0]
[null,{"$f":"IF(ISNA(VLOOKUP($A49,'EKC1'!$P$4:$AB$48,12,FALSE)),\"\",VLOOKUP($A49,'EKC1'!$P$4:$AB$48,12,FALSE))","v":""},{"$f":"IF(ISNA(VLOOKUP($A49,'EKC2'!$P$4:$AB$48,12,FALSE)),\"\",VLOOKUP($A49,'EKC2'!$P$4:$AB$48,12,FALSE))","v":""},{"$f":"IF(ISNA(VLOOKUP($A49,'EKC3'!$P$4:$AB$48,12,FALSE)),\"\",VLOOKUP($A49,'EKC3'!$P$4:$AB$48,12,FALSE))","v":""},{"$f":"IF(ISNA(VLOOKUP($A49,'EKC4'!$P$4:$AB$48,12,FALSE)),\"\",VLOOKUP($A49,'EKC4'!$P$4:$AB$48,12,FALSE))","v":""},{"$f":"IF(ISNA(VLOOKUP($A49,'EKC5'!$P$4:$AB$48,12,FALSE)),\"\",VLOOKUP($A49,'EKC5'!$P$4:$AB$48,12,FALSE))","v":""},0,null,null,"",0]
[null,{"$f":"IF(ISNA(VLOOKUP($A50,'EKC1'!$P$4:$AB$48,12,FALSE)),\"\",VLOOKUP($A50,'EKC1'!$P$4:$AB$48,12,FALSE))","v":""},{"$f":"IF(ISNA(VLOOKUP($A50,'EKC2'!$P$4:$AB$48,12,FALSE)),\"\",VLOOKUP($A50,'EKC2'!$P$4:$AB$48,12,FALSE))","v":""},{"$f":"IF(ISNA(VLOOKUP($A50,'EKC3'!$P$4:$AB$48,12,FALSE)),\"\",VLOOKUP($A50,'EKC3'!$P$4:$AB$48,12,FALSE))","v":""},{"$f":"IF(ISNA(VLOOKUP($A50,'EKC4'!$P$4:$AB$48,12,FALSE)),\"\",VLOOKUP($A50,'EKC4'!$P$4:$AB$48,12,FALSE))","v":""},{"$f":"IF(ISNA(VLOOKUP($A50,'EKC5'!$P$4:$AB$48,12,FALSE)),\"\",VLOOKUP($A50,'EKC5'!$P$4:$AB$48,12,FALSE))","v":""},0,null,null,"",0]
[null,{"$f":"IF(ISNA(VLOOKUP($A51,'EKC1'!$P$4:$AB$48,12,FALSE)),\"\",VLOOKUP($A51,'EKC1'!$P$4:$AB$48,12,FALSE))","v":""},{"$f":"IF(ISNA(VLOOKUP($A51,'EKC2'!$P$4:$AB$48,12,FALSE)),\"\",VLOOKUP($A51,'EKC2'!$P$4:$AB$48,12,FALSE))","v":""},{"$f":"IF(ISNA(VLOOKUP($A51,'EKC3'!$P$4:$AB$48,12,FALSE)),\"\",VLOOKUP($A51,'EKC3'!$P$4:$AB$48,12,FALSE))","v":""},{"$f":"IF(ISNA(VLOOKUP($A51,'EKC4'!$P$4:$AB$48,12,FALSE)),\"\",VLOOKUP($A51,'EKC4'!$P$4:$AB$48,12,FALSE))","v":""},{"$f":"IF(ISNA(VLOOKUP($A51,'EKC5'!$P$4:$AB$48,12,FALSE)),\"\",VLOOKUP($A51,'EKC5'!$P$4:$AB$48,12,FALSE))","v":""},0,null,null,"",0]
[null,{"$f":"IF(ISNA(VLOOKUP($A52,'EKC1'!$P$4:$AB$48,12,FALSE)),\"\",VLOOKUP($A52,'EKC1'!$P$4:$AB$48,12,FALSE))","v":""},{"$f":"IF(ISNA(VLOOKUP($A52,'EKC2'!$P$4:$AB$48,12,FALSE)),\"\",VLOOKUP($A52,'EKC2'!$P$4:$AB$48,12,FALSE))","v":""},{"$f":"IF(ISNA(VLOOKUP($A52,'EKC3'!$P$4:$AB$48,12,FALSE)),\"\",VLOOKUP($A52,'EKC3'!$P$4:$AB$48,12,FALSE))","v":""},{"$f":"IF(ISNA(VLOOKUP($A52,'EKC4'!$P$4:$AB$48,12,FALSE)),\"\",VLOOKUP($A52,'EKC4'!$P$4:$AB$48,12,FALSE))","v":""},{"$f":"IF(ISNA(VLOOKUP($A52,'EKC5'!$P$4:$AB$48,12,FALSE)),\"\",VLOOKUP($A52,'EKC5'!$P$4:$AB$48,12,FALSE))","v":""},0,null,null,"",0]
[null,{"$f":"IF(ISNA(VLOOKUP($A53,'EKC1'!$P$4:$AB$48,12,FALSE)),\"\",VLOOKUP($A53,'EKC1'!$P$4:$AB$48,12,FALSE))","v":""},{"$f":"IF(ISNA(VLOOKUP($A53,'EKC2'!$P$4:$AB$48,12,FALSE)),\"\",VLOOKUP($A53,'EKC2'!$P$4:$AB$48,12,FALSE))","v":""},{"$f":"IF(ISNA(VLOOKUP($A53,'EKC3'!$P$4:$AB$48,12,FALSE)),\"\",VLOOKUP($A53,'EKC3'!$P$4:$AB$48,12,FALSE))","v":""},{"$f":"IF(ISNA(VLOOKUP($A53,'EKC4'!$P$4:$AB$48,12,FALSE)),\"\",VLOOKUP($A53,'EKC4'!$P$4:$AB$48,12,FALSE))","v":""},{"$f":"IF(ISNA(VLOOKUP($A53,'EKC5'!$P$4:$AB$48,12,FALSE)),\"\",VLOOKUP($A53,'EKC5'!$P$4:$AB$48,12,FALSE))","v":""},0,null,null,"",0]
[null,{"$f":"IF(ISNA(VLOOKUP($A54,'EKC1'!$P$4:$AB$48,12,FALSE)),\"\",VLOOKUP($A54,'EKC1'!$P$4:$AB$48,12,FALSE))","v":""},{"$f":"IF(ISNA(VLOOKUP($A54,'EKC2'!$P$4:$AB$48,12,FALSE)),\"\",VLOOKUP($A54,'EKC2'!$P$4:$AB$48,12,FALSE))","v":""},{"$f":"IF(ISNA(VLOOKUP($A54,'EKC3'!$P$4:$AB$48,12,FALSE)),\"\",VLOOKUP($A54,'EKC3'!$P$4:$AB$48,12,FALSE))","v":""},{"$f":"IF(ISNA(VLOOKUP($A54,'EKC4'!$P$4:$AB$48,12,FALSE)),\"\",VLOOKUP($A54,'EKC4'!$P$4:$AB$48,12,FALSE))","v":""},{"$f":"IF(ISNA(VLOOKUP($A54,'EKC5'!$P$4:$AB$48,12,FALSE)),\"\",VLOOKUP($A54,'EKC5'!$P$4:$AB$48,12,FALSE))","v":""},0,null,null,"",0]
[null,{"$f":"IF(ISNA(VLOOKUP($A55,'EKC1'!$P$4:$AB$48,12,FALSE)),\"\",VLOOKUP($A55,'EKC1'!$P$4:$AB$48,12,FALSE))","v":""},{"$f":"IF(ISNA(VLOOKUP($A55,'EKC2'!$P$4:$AB$48,12,FALSE)),\"\",VLOOKUP($A55,'EKC2'!$P$4:$AB$48,12,FALSE))","v":""},{"$f":"IF(ISNA(VLOOKUP($A55,'EKC3'!$P$4:$AB$48,12,FALSE)),\"\",VLOOKUP($A55,'EKC3'!$P$4:$AB$48,12,FALSE))","v":""},{"$f":"IF(ISNA(VLOOKUP($A55,'EKC4'!$P$4:$AB$48,12,FALSE)),\"\",VLOOKUP($A55,'EKC4'!$P$4:$AB$48,12,FALSE))","v":""},{"$f":"IF(ISNA(VLOOKUP($A55,'EKC5'!$P$4:$AB$48,12,FALSE)),\"\",VLOOKUP($A55,'EKC5'!$P$4:$AB$48,12,FALSE))","v":""},0,null,null,"",0]
[null,{"$f":"IF(ISNA(VLOOKUP($A56,'EKC1'!$P$4:$AB$48,12,FALSE)),\"\",VLOOKUP($A56,'EKC1'!$P$4:$AB$48,12,FALSE))","v":""},{"$f":"IF(ISNA(VLOOKUP($A56,'EKC2'!$P$4:$AB$48,12,FALSE)),\"\",VLOOKUP($A56,'EKC2'!$P$4:$AB$48,12,FALSE))","v":""},{"$f":"IF(ISNA(VLOOKUP($A56,'EKC3'!$P$4:$AB$48,12,FALSE)),\"\",VLOOKUP($A56,'EKC3'!$P$4:$AB$48,12,FALSE))","v":""},{"$f":"IF(ISNA(VLOOKUP($A56,'EKC4'!$P$4:$AB$48,12,FALSE)),\"\",VLOOKUP($A56,'EKC4'!$P$4:$AB$48,12,FALSE))","v":""},{"$f":"IF(ISNA(VLOOKUP($A56,'EKC5'!$P$4:$AB$48,12,FALSE)),\"\",VLOOKUP($A56,'EKC5'!$P$4:$AB$48,12,FALSE))","v":""},0,null,null,"",0]
[null,{"$f":"IF(ISNA(VLOOKUP($A57,'EKC1'!$P$4:$AB$48,12,FALSE)),\"\",VLOOKUP($A57,'EKC1'!$P$4:$AB$48,12,FALSE))","v":""},{"$f":"IF(ISNA(VLOOKUP($A57,'EKC2'!$P$4:$AB$48,12,FALSE)),\"\",VLOOKUP($A57,'EKC2'!$P$4:$AB$48,12,FALSE))","v":""},{"$f":"IF(ISNA(VLOOKUP($A57,'EKC3'!$P$4:$AB$48,12,FALSE)),\"\",VLOOKUP($A57,'EKC3'!$P$4:$AB$48,12,FALSE))","v":""},{"$f":"IF(ISNA(VLOOKUP($A57,'EKC4'!$P$4:$AB$48,12,FALSE)),\"\",VLOOKUP($A57,'EKC4'!$P$4:$AB$48,12,FALSE))","v":""},{"$f":"IF(ISNA(VLOOKUP($A57,'EKC5'!$P$4:$AB$48,12,FALSE)),\"\",VLOOKUP($A57,'EKC5'!$P$4:$AB$48,12,FALSE))","v":""},0,null,null,"",0]
[null,{"$f":"IF(ISNA(VLOOKUP($A58,'EKC1'!$P$4:$AB$48,12,FALSE)),\"\",VLOOKUP($A58,'EKC1'!$P$4:$AB$48,12,FALSE))","v":""},{"$f":"IF(ISNA(VLOOKUP($A58,'EKC2'!$P$4:$AB$48,12,FALSE)),\"\",VLOOKUP($A58,'EKC2'!$P$4:$AB$48,12,FALSE))","v":""},{"$f":"IF(ISNA(VLOOKUP($A58,'EKC3'!$P$4:$AB$48,12,FALSE)),\"\",VLOOKUP($A58,'EKC3'!$P$4:$AB$48,12,FALSE))","v":""},{"$f":"IF(ISNA(VLOOKUP($A58,'EKC4'!$P$4:$AB$48,12,FALSE)),\"\",VLOOKUP($A58,'EKC4'!$P$4:$AB$48,12,FALSE))","v":""},{"$f":"IF(ISNA(VLOOKUP($A58,'EKC5'!$P$4:$AB$48,12,FALSE)),\"\",VLOOKUP($A58,'EKC5'!$P$4:$AB$48,12,FALSE))","v":""},0,null,null,"",0]
[null,{"$f":"IF(ISNA(VLOOKUP($A59,'EKC1'!$P$4:$AB$48,12,FALSE)),\"\",VLOOKUP($A59,'EKC1'!$P$4:$AB$48,12,FALSE))","v":""},{"$f":"IF(ISNA(VLOOKUP($A59,'EKC2'!$P$4:$AB$48,12,FALSE)),\"\",VLOOKUP($A59,'EKC2'!$P$4:$AB$48,12,FALSE))","v":""},{"$f":"IF(ISNA(VLOOKUP($A59,'EKC3'!$P$4:$AB$48,12,FALSE)),\"\",VLOOKUP($A59,'EKC3'!$P$4:$AB$48,12,FALSE))","v":""},{"$f":"IF(ISNA(VLOOKUP($A59,'EKC4'!$P$4:$AB$48,12,FALSE)),\"\",VLOOKUP($A59,'EKC4'!$P$4:$AB$48,12,FALSE))","v":""},{"$f":"IF(ISNA(VLOOKUP($A59,'EKC5'!$P$4:$AB$48,12,FALSE)),\"\",VLOOKUP($A59,'EKC5'!$P$4:$AB$48,12,FALSE))","v":""},0,null,null,"",0]
[null,{"$f":"IF(ISNA(VLOOKUP($A60,'EKC1'!$P$4:$AB$48,12,FALSE)),\"\",VLOOKUP($A60,'EKC1'!$P$4:$AB$48,12,FALSE))","v":""},{"$f":"IF(ISNA(VLOOKUP($A60,'EKC2'!$P$4:$AB$48,12,FALSE)),\"\",VLOOKUP($A60,'EKC2'!$P$4:$AB$48,12,FALSE))","v":""},{"$f":"IF(ISNA(VLOOKUP($A60,'EKC3'!$P$4:$AB$48,12,FALSE)),\"\",VLOOKUP($A60,'EKC3'!$P$4:$AB$48,12,FALSE))","v":""},{"$f":"IF(ISNA(VLOOKUP($A60,'EKC4'!$P$4:$AB$48,12,FALSE)),\"\",VLOOKUP($A60,'EKC4'!$P$4:$AB$48,12,FALSE))","v":""},{"$f":"IF(ISNA(VLOOKUP($A60,'EKC5'!$P$4:$AB$48,12,FALSE)),\"\",VLOOKUP($A60,'EKC5'!$P$4:$AB$48,12,FALSE))","v":""},0,null,null,"",0]
[null,{"$f":"IF(ISNA(VLOOKUP($A61,'EKC1'!$P$4:$AB$48,12,FALSE)),\"\",VLOOKUP($A61,'EKC1'!$P$4:$AB$48,12,FALSE))","v":""},{"$f":"IF(ISNA(VLOOKUP($A61,'EKC2'!$P$4:$AB$48,12,FALSE)),\"\",VLOOKUP($A61,'EKC2'!$P$4:$AB$48,12,FALSE))","v":""},{"$f":"IF(ISNA(VLOOKUP($A61,'EKC3'!$P$4:$AB$48,12,FALSE)),\"\",VLOOKUP($A61,'EKC3'!$P$4:$AB$48,12,FALSE))","v":""},{"$f":"IF(ISNA(VLOOKUP($A61,'EKC4'!$P$4:$AB$48,12,FALSE)),\"\",VLOOKUP($A61,'EKC4'!$P$4:$AB$48,12,FALSE))","v":""},{"$f":"IF(ISNA(VLOOKUP($A61,'EKC5'!$P$4:$AB$48,12,FALSE)),\"\",VLOOKUP($A61,'EKC5'!$P$4:$AB$48,12,FALSE))","v":""},0,null,null,"",0]
[null,{"$f":"IF(ISNA(VLOOKUP($A62,'EKC1'!$P$4:$AB$48,12,FALSE)),\"\",VLOOKUP($A62,'EKC1'!$P$4:$AB$48,12,FALSE))","v":""},{"$f":"IF(ISNA(VLOOKUP($A62,'EKC2'!$P$4:$AB$48,12,FALSE)),\"\",VLOOKUP($A62,'EKC2'!$P$4:$AB$48,12,FALSE))","v":""},{"$f":"IF(ISNA(VLOOKUP($A62,'EKC3'!$P$4:$AB$48,12,FALSE)),\"\",VLOOKUP($A62,'EKC3'!$P$4:$AB$48,12,FALSE))","v":""},{"$f":"IF(ISNA(VLOOKUP($A62,'EKC4'!$P$4:$AB$48,12,FALSE)),\"\",VLOOKUP($A62,'EKC4'!$P$4:$AB$48,12,FALSE))","v":""},{"$f":"IF(ISNA(VLOOKUP($A62,'EKC5'!$P$4:$AB$48,12,FALSE)),\"\",VLOOKUP($A62,'EKC5'!$P$4:$AB$48,12,FALSE))","v":""},0,null,null,"",0]
[null,{"$f":"IF(ISNA(VLOOKUP($A63,'EKC1'!$P$4:$AB$48,12,FALSE)),\"\",VLOOKUP($A63,'EKC1'!$P$4:$AB$48,12,FALSE))","v":""},{"$f":"IF(ISNA(VLOOKUP($A63,'EKC2'!$P$4:$AB$48,12,FALSE)),\"\",VLOOKUP($A63,'EKC2'!$P$4:$AB$48,12,FALSE))","v":""},{"$f":"IF(ISNA(VLOOKUP($A63,'EKC3'!$P$4:$AB$48,12,FALSE)),\"\",VLOOKUP($A63,'EKC3'!$P$4:$AB$48,12,FALSE))","v":""},{"$f":"IF(ISNA(VLOOKUP($A63,'EKC4'!$P$4:$AB$48,12,FALSE)),\"\",VLOOKUP($A63,'EKC4'!$P$4:$AB$48,12,FALSE))","v":""},{"$f":"IF(ISNA(VLOOKUP($A63,'EKC5'!$P$4:$AB$48,12,FALSE)),\"\",VLOOKUP($A63,'EKC5'!$P$4:$AB$48,12,FALSE))","v":""},0,null,null,"",0]
[null,{"$f":"IF(ISNA(VLOOKUP($A64,'EKC1'!$P$4:$AB$48,12,FALSE)),\"\",VLOOKUP($A64,'EKC1'!$P$4:$AB$48,12,FALSE))","v":""},{"$f":"IF(ISNA(VLOOKUP($A64,'EKC2'!$P$4:$AB$48,12,FALSE)),\"\",VLOOKUP($A64,'EKC2'!$P$4:$AB$48,12,FALSE))","v":""},{"$f":"IF(ISNA(VLOOKUP($A64,'EKC3'!$P$4:$AB$48,12,FALSE)),\"\",VLOOKUP($A64,'EKC3'!$P$4:$AB$48,12,FALSE))","v":""},{"$f":"IF(ISNA(VLOOKUP($A64,'EKC4'!$P$4:$AB$48,12,FALSE)),\"\",VLOOKUP($A64,'EKC4'!$P$4:$AB$48,12,FALSE))","v":""},{"$f":"IF(ISNA(VLOOKUP($A64,'EKC5'!$P$4:$AB$48,12,FALSE)),\"\",VLOOKUP($A64,'EKC5'!$P$4:$AB$48,12,FALSE))","v":""},0,null,null,"",0]
[null,{"$f":"IF(ISNA(VLOOKUP($A65,'EKC1'!$P$4:$AB$48,12,FALSE)),\"\",VLOOKUP($A65,'EKC1'!$P$4:$AB$48,12,FALSE))","v":""},{"$f":"IF(ISNA(VLOOKUP($A65,'EKC2'!$P$4:$AB$48,12,FALSE)),\"\",VLOOKUP($A65,'EKC2'!$P$4:$AB$48,12,FALSE))","v":""},{"$f":"IF(ISNA(VLOOKUP($A65,'EKC3'!$P$4:$AB$48,12,FALSE)),\"\",VLOOKUP($A65,'EKC3'!$P$4:$AB$48,12,FALSE))","v":""},{"$f":"IF(ISNA(VLOOKUP($A65,'EKC4'!$P$4:$AB$48,12,FALSE)),\"\",VLOOKUP($A65,'EKC4'!$P$4:$AB$48,12,FALSE))","v":""},{"$f":"IF(ISNA(VLOOKUP($A65,'EKC5'!$P$4:$AB$48,12,FALSE)),\"\",VLOOKUP($A65,'EKC5'!$P$4:$AB$48,12,FALSE))","v":""},0,null,null,"",0]
[null,{"$f":"IF(ISNA(VLOOKUP($A66,'EKC1'!$P$4:$AB$48,12,FALSE)),\"\",VLOOKUP($A66,'EKC1'!$P$4:$AB$48,12,FALSE))","v":""},{"$f":"IF(ISNA(VLOOKUP($A66,'EKC2'!$P$4:$AB$48,12,FALSE)),\"\",VLOOKUP($A66,'EKC2'!$P$4:$AB$48,12,FALSE))","v":""},{"$f":"IF(ISNA(VLOOKUP($A66,'EKC3'!$P$4:$AB$48,12,FALSE)),\"\",VLOOKUP($A66,'EKC3'!$P$4:$AB$48,12,FALSE))","v":""},{"$f":"IF(ISNA(VLOOKUP($A66,'EKC4'!$P$4:$AB$48,12,FALSE)),\"\",VLOOKUP($A66,'EKC4'!$P$4:$AB$48,12,FALSE))","v":""},{"$f":"IF(ISNA(VLOOKUP($A66,'EKC5'!$P$4:$AB$48,12,FALSE)),\"\",VLOOKUP($A66,'EKC5'!$P$4:$AB$48,12,FALSE))","v":""},0,null,null,"",{"$f":"IF(ISBLANK(A67),0,1)","v":0}]
[null,{"$f":"IF(ISNA(VLOOKUP($A67,'EKC1'!$P$4:$AB$48,12,FALSE)),\"\",VLOOKUP($A67,'EKC1'!$P$4:$AB$48,12,FALSE))","v":""},{"$f":"IF(ISNA(VLOOKUP($A67,'EKC2'!$P$4:$AB$48,12,FALSE)),\"\",VLOOKUP($A67,'EKC2'!$P$4:$AB$48,12,FALSE))","v":""},{"$f":"IF(ISNA(VLOOKUP($A67,'EKC3'!$P$4:$AB$48,12,FALSE)),\"\",VLOOKUP($A67,'EKC3'!$P$4:$AB$48,12,FALSE))","v":""},{"$f":"IF(ISNA(VLOOKUP($A67,'EKC4'!$P$4:$AB$48,12,FALSE)),\"\",VLOOKUP($A67,'EKC4'!$P$4:$AB$48,12,FALSE))","v":""},{"$f":"IF(ISNA(VLOOKUP($A67,'EKC5'!$P$4:$AB$48,12,FALSE)),\"\",VLOOKUP($A67,'EKC5'!$P$4:$AB$48,12,FALSE))","v":""},0,null,null,"",0]
[null,{"$f":"IF(ISNA(VLOOKUP($A68,'EKC1'!$P$4:$AB$48,12,FALSE)),\"\",VLOOKUP($A68,'EKC1'!$P$4:$AB$48,12,FALSE))","v":""},{"$f":"IF(ISNA(VLOOKUP($A68,'EKC2'!$P$4:$AB$48,12,FALSE)),\"\",VLOOKUP($A68,'EKC2'!$P$4:$AB$48,12,FALSE))","v":""},{"$f":"IF(ISNA(VLOOKUP($A68,'EKC3'!$P$4:$AB$48,12,FALSE)),\"\",VLOOKUP($A68,'EKC3'!$P$4:$AB$48,12,FALSE))","v":""},{"$f":"IF(ISNA(VLOOKUP($A68,'EKC4'!$P$4:$AB$48,12,FALSE)),\"\",VLOOKUP($A68,'EKC4'!$P$4:$AB$48,12,FALSE))","v":""},{"$f":"IF(ISNA(VLOOKUP($A68,'EKC5'!$P$4:$AB$48,12,FALSE)),\"\",VLOOKUP($A68,'EKC5'!$P$4:$AB$48,12,FALSE))","v":""},{"$f":"IF(SUM(B68:F68)=0,0,SUM(B68:F68))","v":0},null,null,{"$f":"IF(ISBLANK(A68),\"\",IF(A69=A68,1,\"\"))","v":""},0]
[null,{"$f":"IF(ISNA(VLOOKUP($A69,'EKC1'!$P$4:$AB$48,12,FALSE)),\"\",VLOOKUP($A69,'EKC1'!$P$4:$AB$48,12,FALSE))","v":""},{"$f":"IF(ISNA(VLOOKUP($A69,'EKC2'!$P$4:$AB$48,12,FALSE)),\"\",VLOOKUP($A69,'EKC2'!$P$4:$AB$48,12,FALSE))","v":""},{"$f":"IF(ISNA(VLOOKUP($A69,'EKC3'!$P$4:$AB$48,12,FALSE)),\"\",VLOOKUP($A69,'EKC3'!$P$4:$AB$48,12,FALSE))","v":""},{"$f":"IF(ISNA(VLOOKUP($A69,'EKC4'!$P$4:$AB$48,12,FALSE)),\"\",VLOOKUP($A69,'EKC4'!$P$4:$AB$48,12,FALSE))","v":""},{"$f":"IF(ISNA(VLOOKUP($A69,'EKC5'!$P$4:$AB$48,12,FALSE)),\"\",VLOOKUP($A69,'EKC5'!$P$4:$AB$48,12,FALSE))","v":""},0,null,null,"",0]
[null,{"$f":"IF(ISNA(VLOOKUP($A70,'EKC1'!$P$4:$AB$48,12,FALSE)),\"\",VLOOKUP($A70,'EKC1'!$P$4:$AB$48,12,FALSE))","v":""},{"$f":"IF(ISNA(VLOOKUP($A70,'EKC2'!$P$4:$AB$48,12,FALSE)),\"\",VLOOKUP($A70,'EKC2'!$P$4:$AB$48,12,FALSE))","v":""},{"$f":"IF(ISNA(VLOOKUP($A70,'EKC3'!$P$4:$AB$48,12,FALSE)),\"\",VLOOKUP($A70,'EKC3'!$P$4:$AB$48,12,FALSE))","v":""},{"$f":"IF(ISNA(VLOOKUP($A70,'EKC4'!$P$4:$AB$48,12,FALSE)),\"\",VLOOKUP($A70,'EKC4'!$P$4:$AB$48,12,FALSE))","v":""},{"$f":"IF(ISNA(VLOOKUP($A70,'EKC5'!$P$4:$AB$48,12,FALSE)),\"\",VLOOKUP($A70,'EKC5'!$P$4:$AB$48,12,FALSE))","v":""},0,null,null,"",0]
[null,{"$f":"IF(ISNA(VLOOKUP($A71,'EKC1'!$P$4:$AB$48,12,FALSE)),\"\",VLOOKUP($A71,'EKC1'!$P$4:$AB$48,12,FALSE))","v":""},{"$f":"IF(ISNA(VLOOKUP($A71,'EKC2'!$P$4:$AB$48,12,FALSE)),\"\",VLOOKUP($A71,'EKC2'!$P$4:$AB$48,12,FALSE))","v":""},{"$f":"IF(ISNA(VLOOKUP($A71,'EKC3'!$P$4:$AB$48,12,FALSE)),\"\",VLOOKUP($A71,'EKC3'!$P$4:$AB$48,12,FALSE))","v":""},{"$f":"IF(ISNA(VLOOKUP($A71,'EKC4'!$P$4:$AB$48,12,FALSE)),\"\",VLOOKUP($A71,'EKC4'!$P$4:$AB$48,12,FALSE))","v":""},{"$f":"IF(ISNA(VLOOKUP($A71,'EKC5'!$P$4:$AB$48,12,FALSE)),\"\",VLOOKUP($A71,'EKC5'!$P$4:$AB$48,12,FALSE))","v":""},0,null,null,"",0]
[null,{"$f":"IF(ISNA(VLOOKUP($A72,'EKC1'!$P$4:$AB$48,12,FALSE)),\"\",VLOOKUP($A72,'EKC1'!$P$4:$AB$48,12,FALSE))","v":""},{"$f":"IF(ISNA(VLOOKUP($A72,'EKC2'!$P$4:$AB$48,12,FALSE)),\"\",VLOOKUP($A72,'EKC2'!$P$4:$AB$48,12,FALSE))","v":""},{"$f":"IF(ISNA(VLOOKUP($A72,'EKC3'!$P$4:$AB$48,12,FALSE)),\"\",VLOOKUP($A72,'EKC3'!$P$4:$AB$48,12,FALSE))","v":""},{"$f":"IF(ISNA(VLOOKUP($A72,'EKC4'!$P$4:$AB$48,12,FALSE)),\"\",VLOOKUP($A72,'EKC4'!$P$4:$AB$48,12,FALSE))","v":""},{"$f":"IF(ISNA(VLOOKUP($A72,'EKC5'!$P$4:$AB$48,12,FALSE)),\"\",VLOOKUP($A72,'EKC5'!$P$4:$AB$48,12,FALSE))","v":""},0,null,null,"",0]
[null,{"$f":"IF(ISNA(VLOOKUP($A73,'EKC1'!$P$4:$AB$48,12,FALSE)),\"\",VLOOKUP($A73,'EKC1'!$P$4:$AB$48,12,FALSE))","v":""},{"$f":"IF(ISNA(VLOOKUP($A73,'EKC2'!$P$4:$AB$48,12,FALSE)),\"\",VLOOKUP($A73,'EKC2'!$P$4:$AB$48,12,FALSE))","v":""},{"$f":"IF(ISNA(VLOOKUP($A73,'EKC3'!$P$4:$AB$48,12,FALSE)),\"\",VLOOKUP($A73,'EKC3'!$P$4:$AB$48,12,FALSE))","v":""},{"$f":"IF(ISNA(VLOOKUP($A73,'EKC4'!$P$4:$AB$48,12,FALSE)),\"\",VLOOKUP($A73,'EKC4'!$P$4:$AB$48,12,FALSE))","v":""},{"$f":"IF(ISNA(VLOOKUP($A73,'EKC5'!$P$4:$AB$48,12,FALSE)),\"\",VLOOKUP($A73,'EKC5'!$P$4:$AB$48,12,FALSE))","v":""},0,null,null,"",0]
[null,{"$f":"IF(ISNA(VLOOKUP($A74,'EKC1'!$P$4:$AB$48,12,FALSE)),\"\",VLOOKUP($A74,'EKC1'!$P$4:$AB$48,12,FALSE))","v":""},{"$f":"IF(ISNA(VLOOKUP($A74,'EKC2'!$P$4:$AB$48,12,FALSE)),\"\",VLOOKUP($A74,'EKC2'!$P$4:$AB$48,12,FALSE))","v":""},{"$f":"IF(ISNA(VLOOKUP($A74,'EKC3'!$P$4:$AB$48,12,FALSE)),\"\",VLOOKUP($A74,'EKC3'!$P$4:$AB$48,12,FALSE))","v":""},{"$f":"IF(ISNA(VLOOKUP($A74,'EKC4'!$P$4:$AB$48,12,FALSE)),\"\",VLOOKUP($A74,'EKC4'!$P$4:$AB$48,12,FALSE))","v":""},{"$f":"IF(ISNA(VLOOKUP($A74,'EKC5'!$P$4:$AB$48,12,FALSE)),\"\",VLOOKUP($A74,'EKC5'!$P$4:$AB$48,12,FALSE))","v":""},0,null,null,"",0]
[null,{"$f":"IF(ISNA(VLOOKUP($A75,'EKC1'!$P$4:$AB$48,12,FALSE)),\"\",VLOOKUP($A75,'EKC1'!$P$4:$AB$48,12,FALSE))","v":""},{"$f":"IF(ISNA(VLOOKUP($A75,'EKC2'!$P$4:$AB$48,12,FALSE)),\"\",VLOOKUP($A75,'EKC2'!$P$4:$AB$48,12,FALSE))","v":""},{"$f":"IF(ISNA(VLOOKUP($A75,'EKC3'!$P$4:$AB$48,12,FALSE)),\"\",VLOOKUP($A75,'EKC3'!$P$4:$AB$48,12,FALSE))","v":""},{"$f":"IF(ISNA(VLOOKUP($A75,'EKC4'!$P$4:$AB$48,12,FALSE)),\"\",VLOOKUP($A75,'EKC4'!$P$4:$AB$48,12,FALSE))","v":""},{"$f":"IF(ISNA(VLOOKUP($A75,'EKC5'!$P$4:$AB$48,12,FALSE)),\"\",VLOOKUP($A75,'EKC5'!$P$4:$AB$48,12,FALSE))","v":""},0,null,null,"",0]
[null,{"$f":"IF(ISNA(VLOOKUP($A76,'EKC1'!$P$4:$AB$48,12,FALSE)),\"\",VLOOKUP($A76,'EKC1'!$P$4:$AB$48,12,FALSE))","v":""},{"$f":"IF(ISNA(VLOOKUP($A76,'EKC2'!$P$4:$AB$48,12,FALSE)),\"\",VLOOKUP($A76,'EKC2'!$P$4:$AB$48,12,FALSE))","v":""},{"$f":"IF(ISNA(VLOOKUP($A76,'EKC3'!$P$4:$AB$48,12,FALSE)),\"\",VLOOKUP($A76,'EKC3'!$P$4:$AB$48,12,FALSE))","v":""},{"$f":"IF(ISNA(VLOOKUP($A76,'EKC4'!$P$4:$AB$48,12,FALSE)),\"\",VLOOKUP($A76,'EKC4'!$P$4:$AB$48,12,FALSE))","v":""},{"$f":"IF(ISNA(VLOOKUP($A76,'EKC5'!$P$4:$AB$48,12,FALSE)),\"\",VLOOKUP($A76,'EKC5'!$P$4:$AB$48,12,FALSE))","v":""},0,null,null,"",0]
[null,{"$f":"IF(ISNA(VLOOKUP($A77,'EKC1'!$P$4:$AB$48,12,FALSE)),\"\",VLOOKUP($A77,'EKC1'!$P$4:$AB$48,12,FALSE))","v":""},{"$f":"IF(ISNA(VLOOKUP($A77,'EKC2'!$P$4:$AB$48,12,FALSE)),\"\",VLOOKUP($A77,'EKC2'!$P$4:$AB$48,12,FALSE))","v":""},{"$f":"IF(ISNA(VLOOKUP($A77,'EKC3'!$P$4:$AB$48,12,FALSE)),\"\",VLOOKUP($A77,'EKC3'!$P$4:$AB$48,12,FALSE))","v":""},{"$f":"IF(ISNA(VLOOKUP($A77,'EKC4'!$P$4:$AB$48,12,FALSE)),\"\",VLOOKUP($A77,'EKC4'!$P$4:$AB$48,12,FALSE))","v":""},{"$f":"IF(ISNA(VLOOKUP($A77,'EKC5'!$P$4:$AB$48,12,FALSE)),\"\",VLOOKUP($A77,'EKC5'!$P$4:$AB$48,12,FALSE))","v":""},0,null,null,"",0]
[null,{"$f":"IF(ISNA(VLOOKUP($A78,'EKC1'!$P$4:$AB$48,12,FALSE)),\"\",VLOOKUP($A78,'EKC1'!$P$4:$AB$48,12,FALSE))","v":""},{"$f":"IF(ISNA(VLOOKUP($A78,'EKC2'!$P$4:$AB$48,12,FALSE)),\"\",VLOOKUP($A78,'EKC2'!$P$4:$AB$48,12,FALSE))","v":""},{"$f":"IF(ISNA(VLOOKUP($A78,'EKC3'!$P$4:$AB$48,12,FALSE)),\"\",VLOOKUP($A78,'EKC3'!$P$4:$AB$48,12,FALSE))","v":""},{"$f":"IF(ISNA(VLOOKUP($A78,'EKC4'!$P$4:$AB$48,12,FALSE)),\"\",VLOOKUP($A78,'EKC4'!$P$4:$AB$48,12,FALSE))","v":""},{"$f":"IF(ISNA(VLOOKUP($A78,'EKC5'!$P$4:$AB$48,12,FALSE)),\"\",VLOOKUP($A78,'EKC5'!$P$4:$AB$48,12,FALSE))","v":""},0,null,null,"",0]
[null,{"$f":"IF(ISNA(VLOOKUP($A79,'EKC1'!$P$4:$AB$48,12,FALSE)),\"\",VLOOKUP($A79,'EKC1'!$P$4:$AB$48,12,FALSE))","v":""},{"$f":"IF(ISNA(VLOOKUP($A79,'EKC2'!$P$4:$AB$48,12,FALSE)),\"\",VLOOKUP($A79,'EKC2'!$P$4:$AB$48,12,FALSE))","v":""},{"$f":"IF(ISNA(VLOOKUP($A79,'EKC3'!$P$4:$AB$48,12,FALSE)),\"\",VLOOKUP($A79,'EKC3'!$P$4:$AB$48,12,FALSE))","v":""},{"$f":"IF(ISNA(VLOOKUP($A79,'EKC4'!$P$4:$AB$48,12,FALSE)),\"\",VLOOKUP($A79,'EKC4'!$P$4:$AB$48,12,FALSE))","v":""},{"$f":"IF(ISNA(VLOOKUP($A79,'EKC5'!$P$4:$AB$48,12,FALSE)),\"\",VLOOKUP($A79,'EKC5'!$P$4:$AB$48,12,FALSE))","v":""},0,null,null,"",0]
[null,{"$f":"IF(ISNA(VLOOKUP($A80,'EKC1'!$P$4:$AB$48,12,FALSE)),\"\",VLOOKUP($A80,'EKC1'!$P$4:$AB$48,12,FALSE))","v":""},{"$f":"IF(ISNA(VLOOKUP($A80,'EKC2'!$P$4:$AB$48,12,FALSE)),\"\",VLOOKUP($A80,'EKC2'!$P$4:$AB$48,12,FALSE))","v":""},{"$f":"IF(ISNA(VLOOKUP($A80,'EKC3'!$P$4:$AB$48,12,FALSE)),\"\",VLOOKUP($A80,'EKC3'!$P$4:$AB$48,12,FALSE))","v":""},{"$f":"IF(ISNA(VLOOKUP($A80,'EKC4'!$P$4:$AB$48,12,FALSE)),\"\",VLOOKUP($A80,'EKC4'!$P$4:$AB$48,12,FALSE))","v":""},{"$f":"IF(ISNA(VLOOKUP($A80,'EKC5'!$P$4:$AB$48,12,FALSE)),\"\",VLOOKUP($A80,'EKC5'!$P$4:$AB$48,12,FALSE))","v":""},0,null,null,"",0]
[null,{"$f":"IF(ISNA(VLOOKUP($A81,'EKC1'!$P$4:$AB$48,12,FALSE)),\"\",VLOOKUP($A81,'EKC1'!$P$4:$AB$48,12,FALSE))","v":""},{"$f":"IF(ISNA(VLOOKUP($A81,'EKC2'!$P$4:$AB$48,12,FALSE)),\"\",VLOOKUP($A81,'EKC2'!$P$4:$AB$48,12,FALSE))","v":""},{"$f":"IF(ISNA(VLOOKUP($A81,'EKC3'!$P$4:$AB$48,12,FALSE)),\"\",VLOOKUP($A81,'EKC3'!$P$4:$AB$48,12,FALSE))","v":""},{"$f":"IF(ISNA(VLOOKUP($A81,'EKC4'!$P$4:$AB$48,12,FALSE)),\"\",VLOOKUP($A81,'EKC4'!$P$4:$AB$48,12,FALSE))","v":""},{"$f":"IF(ISNA(VLOOKUP($A81,'EKC5'!$P$4:$AB$48,12,FALSE)),\"\",VLOOKUP($A81,'EKC5'!$P$4:$AB$48,12,FALSE))","v":""},0,null,null,"",0]
[null,{"$f":"IF(ISNA(VLOOKUP($A82,'EKC1'!$P$4:$AB$48,12,FALSE)),\"\",VLOOKUP($A82,'EKC1'!$P$4:$AB$48,12,FALSE))","v":""},{"$f":"IF(ISNA(VLOOKUP($A82,'EKC2'!$P$4:$AB$48,12,FALSE)),\"\",VLOOKUP($A82,'EKC2'!$P$4:$AB$48,12,FALSE))","v":""},{"$f":"IF(ISNA(VLOOKUP($A82,'EKC3'!$P$4:$AB$48,12,FALSE)),\"\",VLOOKUP($A82,'EKC3'!$P$4:$AB$48,12,FALSE))","v":""},{"$f":"IF(ISNA(VLOOKUP($A82,'EKC4'!$P$4:$AB$48,12,FALSE)),\"\",VLOOKUP($A82,'EKC4'!$P$4:$AB$48,12,FALSE))","v":""},{"$f":"IF(ISNA(VLOOKUP($A82,'EKC5'!$P$4:$AB$48,12,FALSE)),\"\",VLOOKUP($A82,'EKC5'!$P$4:$AB$48,12,FALSE))","v":""},0,null,null,"",0]
[null,{"$f":"IF(ISNA(VLOOKUP($A83,'EKC1'!$P$4:$AB$48,12,FALSE)),\"\",VLOOKUP($A83,'EKC1'!$P$4:$AB$48,12,FALSE))","v":""},{"$f":"IF(ISNA(VLOOKUP($A83,'EKC2'!$P$4:$AB$48,12,FALSE)),\"\",VLOOKUP($A83,'EKC2'!$P$4:$AB$48,12,FALSE))","v":""},{"$f":"IF(ISNA(VLOOKUP($A83,'EKC3'!$P$4:$AB$48,12,FALSE)),\"\",VLOOKUP($A83,'EKC3'!$P$4:$AB$48,12,FALSE))","v":""},{"$f":"IF(ISNA(VLOOKUP($A83,'EKC4'!$P$4:$AB$48,12,FALSE)),\"\",VLOOKUP($A83,'EKC4'!$P$4:$AB$48,12,FALSE))","v":""},{"$f":"IF(ISNA(VLOOKUP($A83,'EKC5'!$P$4:$AB$48,12,FALSE)),\"\",VLOOKUP($A83,'EKC5'!$P$4:$AB$48,12,FALSE))","v":""},0,null,null,"",0]
[null,{"$f":"IF(ISNA(VLOOKUP($A84,'EKC1'!$P$4:$AB$48,12,FALSE)),\"\",VLOOKUP($A84,'EKC1'!$P$4:$AB$48,12,FALSE))","v":""},{"$f":"IF(ISNA(VLOOKUP($A84,'EKC2'!$P$4:$AB$48,12,FALSE)),\"\",VLOOKUP($A84,'EKC2'!$P$4:$AB$48,12,FALSE))","v":""},{"$f":"IF(ISNA(VLOOKUP($A84,'EKC3'!$P$4:$AB$48,12,FALSE)),\"\",VLOOKUP($A84,'EKC3'!$P$4:$AB$48,12,FALSE))","v":""},{"$f":"IF(ISNA(VLOOKUP($A84,'EKC4'!$P$4:$AB$48,12,FALSE)),\"\",VLOOKUP($A84,'EKC4'!$P$4:$AB$48,12,FALSE))","v":""},{"$f":"IF(ISNA(VLOOKUP($A84,'EKC5'!$P$4:$AB$48,12,FALSE)),\"\",VLOOKUP($A84,'EKC5'!$P$4:$AB$48,12,FALSE))","v":""},0,null,null,"",0]
[null,{"$f":"IF(ISNA(VLOOKUP($A85,'EKC1'!$P$4:$AB$48,12,FALSE)),\"\",VLOOKUP($A85,'EKC1'!$P$4:$AB$48,12,FALSE))","v":""},{"$f":"IF(ISNA(VLOOKUP($A85,'EKC2'!$P$4:$AB$48,12,FALSE)),\"\",VLOOKUP($A85,'EKC2'!$P$4:$AB$48,12,FALSE))","v":""},{"$f":"IF(ISNA(VLOOKUP($A85,'EKC3'!$P$4:$AB$48,12,FALSE)),\"\",VLOOKUP($A85,'EKC3'!$P$4:$AB$48,12,FALSE))","v":""},{"$f":"IF(ISNA(VLOOKUP($A85,'EKC4'!$P$4:$AB$48,12,FALSE)),\"\",VLOOKUP($A85,'EKC4'!$P$4:$AB$48,12,FALSE))","v":""},{"$f":"IF(ISNA(VLOOKUP($A85,'EKC5'!$P$4:$AB$48,12,FALSE)),\"\",VLOOKUP($A85,'EKC5'!$P$4:$AB$48,12,FALSE))","v":""},0,null,null,"",0]
[null,{"$f":"IF(ISNA(VLOOKUP($A86,'EKC1'!$P$4:$AB$48,12,FALSE)),\"\",VLOOKUP($A86,'EKC1'!$P$4:$AB$48,12,FALSE))","v":""},{"$f":"IF(ISNA(VLOOKUP($A86,'EKC2'!$P$4:$AB$48,12,FALSE)),\"\",VLOOKUP($A86,'EKC2'!$P$4:$AB$48,12,FALSE))","v":""},{"$f":"IF(ISNA(VLOOKUP($A86,'EKC3'!$P$4:$AB$48,12,FALSE)),\"\",VLOOKUP($A86,'EKC3'!$P$4:$AB$48,12,FALSE))","v":""},{"$f":"IF(ISNA(VLOOKUP($A86,'EKC4'!$P$4:$AB$48,12,FALSE)),\"\",VLOOKUP($A86,'EKC4'!$P$4:$AB$48,12,FALSE))","v":""},{"$f":"IF(ISNA(VLOOKUP($A86,'EKC5'!$P$4:$AB$48,12,FALSE)),\"\",VLOOKUP($A86,'EKC5'!$P$4:$AB$48,12,FALSE))","v":""},0,null,null,"",{"$f":"IF(ISBLANK(A87),0,1)","v":0}]
[null,{"$f":"IF(ISNA(VLOOKUP($A87,'EKC1'!$P$4:$AB$48,12,FALSE)),\"\",VLOOKUP($A87,'EKC1'!$P$4:$AB$48,12,FALSE))","v":""},{"$f":"IF(ISNA(VLOOKUP($A87,'EKC2'!$P$4:$AB$48,12,FALSE)),\"\",VLOOKUP($A87,'EKC2'!$P$4:$AB$48,12,FALSE))","v":""},{"$f":"IF(ISNA(VLOOKUP($A87,'EKC3'!$P$4:$AB$48,12,FALSE)),\"\",VLOOKUP($A87,'EKC3'!$P$4:$AB$48,12,FALSE))","v":""},{"$f":"IF(ISNA(VLOOKUP($A87,'EKC4'!$P$4:$AB$48,12,FALSE)),\"\",VLOOKUP($A87,'EKC4'!$P$4:$AB$48,12,FALSE))","v":""},{"$f":"IF(ISNA(VLOOKUP($A87,'EKC5'!$P$4:$AB$48,12,FALSE)),\"\",VLOOKUP($A87,'EKC5'!$P$4:$AB$48,12,FALSE))","v":""},0,null,null,"",{"$f":"IF(ISBLANK(A88),0,1)","v":0}]
[null,{"$f":"IF(ISNA(VLOOKUP($A88,'EKC1'!$P$4:$AB$48,12,FALSE)),\"\",VLOOKUP($A88,'EKC1'!$P$4:$AB$48,12,FALSE))","v":""},{"$f":"IF(ISNA(VLOOKUP($A88,'EKC2'!$P$4:$AB$48,12,FALSE)),\"\",VLOOKUP($A88,'EKC2'!$P$4:$AB$48,12,FALSE))","v":""},{"$f":"IF(ISNA(VLOOKUP($A88,'EKC3'!$P$4:$AB$48,12,FALSE)),\"\",VLOOKUP($A88,'EKC3'!$P$4:$AB$48,12,FALSE))","v":""},{"$f":"IF(ISNA(VLOOKUP($A88,'EKC4'!$P$4:$AB$48,12,FALSE)),\"\",VLOOKUP($A88,'EKC4'!$P$4:$AB$48,12,FALSE))","v":""},{"$f":"IF(ISNA(VLOOKUP($A88,'EKC5'!$P$4:$AB$48,12,FALSE)),\"\",VLOOKUP($A88,'EKC5'!$P$4:$AB$48,12,FALSE))","v":""},0,null,null,"",0]
[null,{"$f":"IF(ISNA(VLOOKUP($A89,'EKC1'!$P$4:$AB$48,12,FALSE)),\"\",VLOOKUP($A89,'EKC1'!$P$4:$AB$48,12,FALSE))","v":""},{"$f":"IF(ISNA(VLOOKUP($A89,'EKC2'!$P$4:$AB$48,12,FALSE)),\"\",VLOOKUP($A89,'EKC2'!$P$4:$AB$48,12,FALSE))","v":""},{"$f":"IF(ISNA(VLOOKUP($A89,'EKC3'!$P$4:$AB$48,12,FALSE)),\"\",VLOOKUP($A89,'EKC3'!$P$4:$AB$48,12,FALSE))","v":""},{"$f":"IF(ISNA(VLOOKUP($A89,'EKC4'!$P$4:$AB$48,12,FALSE)),\"\",VLOOKUP($A89,'EKC4'!$P$4:$AB$48,12,FALSE))","v":""},{"$f":"IF(ISNA(VLOOKUP($A89,'EKC5'!$P$4:$AB$48,12,FALSE)),\"\",VLOOKUP($A89,'EKC5'!$P$4:$AB$48,12,FALSE))","v":""},0,null,null,"",0]
[null,{"$f":"IF(ISNA(VLOOKUP($A90,'EKC1'!$P$4:$AB$48,12,FALSE)),\"\",VLOOKUP($A90,'EKC1'!$P$4:$AB$48,12,FALSE))","v":""},{"$f":"IF(ISNA(VLOOKUP($A90,'EKC2'!$P$4:$AB$48,12,FALSE)),\"\",VLOOKUP($A90,'EKC2'!$P$4:$AB$48,12,FALSE))","v":""},{"$f":"IF(ISNA(VLOOKUP($A90,'EKC3'!$P$4:$AB$48,12,FALSE)),\"\",VLOOKUP($A90,'EKC3'!$P$4:$AB$48,12,FALSE))","v":""},{"$f":"IF(ISNA(VLOOKUP($A90,'EKC4'!$P$4:$AB$48,12,FALSE)),\"\",VLOOKUP($A90,'EKC4'!$P$4:$AB$48,12,FALSE))","v":""},{"$f":"IF(ISNA(VLOOKUP($A90,'EKC5'!$P$4:$AB$48,12,FALSE)),\"\",VLOOKUP($A90,'EKC5'!$P$4:$AB$48,12,FALSE))","v":""},0,null,null,"",0]
[null,{"$f":"IF(ISNA(VLOOKUP($A91,'EKC1'!$P$4:$AB$48,12,FALSE)),\"\",VLOOKUP($A91,'EKC1'!$P$4:$AB$48,12,FALSE))","v":""},{"$f":"IF(ISNA(VLOOKUP($A91,'EKC2'!$P$4:$AB$48,12,FALSE)),\"\",VLOOKUP($A91,'EKC2'!$P$4:$AB$48,12,FALSE))","v":""},{"$f":"IF(ISNA(VLOOKUP($A91,'EKC3'!$P$4:$AB$48,12,FALSE)),\"\",VLOOKUP($A91,'EKC3'!$P$4:$AB$48,12,FALSE))","v":""},{"$f":"IF(ISNA(VLOOKUP($A91,'EKC4'!$P$4:$AB$48,12,FALSE)),\"\",VLOOKUP($A91,'EKC4'!$P$4:$AB$48,12,FALSE))","v":""},{"$f":"IF(ISNA(VLOOKUP($A91,'EKC5'!$P$4:$AB$48,12,FALSE)),\"\",VLOOKUP($A91,'EKC5'!$P$4:$AB$48,12,FALSE))","v":""},0,null,null,"",0]
[null,{"$f":"IF(ISNA(VLOOKUP($A92,'EKC1'!$P$4:$AB$48,12,FALSE)),\"\",VLOOKUP($A92,'EKC1'!$P$4:$AB$48,12,FALSE))","v":""},{"$f":"IF(ISNA(VLOOKUP($A92,'EKC2'!$P$4:$AB$48,12,FALSE)),\"\",VLOOKUP($A92,'EKC2'!$P$4:$AB$48,12,FALSE))","v":""},{"$f":"IF(ISNA(VLOOKUP($A92,'EKC3'!$P$4:$AB$48,12,FALSE)),\"\",VLOOKUP($A92,'EKC3'!$P$4:$AB$48,12,FALSE))","v":""},{"$f":"IF(ISNA(VLOOKUP($A92,'EKC4'!$P$4:$AB$48,12,FALSE)),\"\",VLOOKUP($A92,'EKC4'!$P$4:$AB$48,12,FALSE))","v":""},{"$f":"IF(ISNA(VLOOKUP($A92,'EKC5'!$P$4:$AB$48,12,FALSE)),\"\",VLOOKUP($A92,'EKC5'!$P$4:$AB$48,12,FALSE))","v":""},0,null,null,"",0]
[null,{"$f":"IF(ISNA(VLOOKUP($A93,'EKC1'!$P$4:$AB$48,12,FALSE)),\"\",VLOOKUP($A93,'EKC1'!$P$4:$AB$48,12,FALSE))","v":""},{"$f":"IF(ISNA(VLOOKUP($A93,'EKC2'!$P$4:$AB$48,12,FALSE)),\"\",VLOOKUP($A93,'EKC2'!$P$4:$AB$48,12,FALSE))","v":""},{"$f":"IF(ISNA(VLOOKUP($A93,'EKC3'!$P$4:$AB$48,12,FALSE)),\"\",VLOOKUP($A93,'EKC3'!$P$4:$AB$48,12,FALSE))","v":""},{"$f":"IF(ISNA(VLOOKUP($A93,'EKC4'!$P$4:$AB$48,12,FALSE)),\"\",VLOOKUP($A93,'EKC4'!$P$4:$AB$48,12,FALSE))","v":""},{"$f":"IF(ISNA(VLOOKUP($A93,'EKC5'!$P$4:$AB$48,12,FALSE)),\"\",VLOOKUP($A93,'EKC5'!$P$4:$AB$48,12,FALSE))","v":""},0,null,null,"",0]
[null,{"$f":"IF(ISNA(VLOOKUP($A94,'EKC1'!$P$4:$AB$48,12,FALSE)),\"\",VLOOKUP($A94,'EKC1'!$P$4:$AB$48,12,FALSE))","v":""},{"$f":"IF(ISNA(VLOOKUP($A94,'EKC2'!$P$4:$AB$48,12,FALSE)),\"\",VLOOKUP($A94,'EKC2'!$P$4:$AB$48,12,FALSE))","v":""},{"$f":"IF(ISNA(VLOOKUP($A94,'EKC3'!$P$4:$AB$48,12,FALSE)),\"\",VLOOKUP($A94,'EKC3'!$P$4:$AB$48,12,FALSE))","v":""},{"$f":"IF(ISNA(VLOOKUP($A94,'EKC4'!$P$4:$AB$48,12,FALSE)),\"\",VLOOKUP($A94,'EKC4'!$P$4:$AB$48,12,FALSE))","v":""},{"$f":"IF(ISNA(VLOOKUP($A94,'EKC5'!$P$4:$AB$48,12,FALSE)),\"\",VLOOKUP($A94,'EKC5'!$P$4:$AB$48,12,FALSE))","v":""},0,null,null,"",0]
[null,{"$f":"IF(ISNA(VLOOKUP($A95,'EKC1'!$P$4:$AB$48,12,FALSE)),\"\",VLOOKUP($A95,'EKC1'!$P$4:$AB$48,12,FALSE))","v":""},{"$f":"IF(ISNA(VLOOKUP($A95,'EKC2'!$P$4:$AB$48,12,FALSE)),\"\",VLOOKUP($A95,'EKC2'!$P$4:$AB$48,12,FALSE))","v":""},{"$f":"IF(ISNA(VLOOKUP($A95,'EKC3'!$P$4:$AB$48,12,FALSE)),\"\",VLOOKUP($A95,'EKC3'!$P$4:$AB$48,12,FALSE))","v":""},{"$f":"IF(ISNA(VLOOKUP($A95,'EKC4'!$P$4:$AB$48,12,FALSE)),\"\",VLOOKUP($A95,'EKC4'!$P$4:$AB$48,12,FALSE))","v":""},{"$f":"IF(ISNA(VLOOKUP($A95,'EKC5'!$P$4:$AB$48,12,FALSE)),\"\",VLOOKUP($A95,'EKC5'!$P$4:$AB$48,12,FALSE))","v":""},0,null,null,"",0]
[null,{"$f":"IF(ISNA(VLOOKUP($A96,'EKC1'!$P$4:$AB$48,12,FALSE)),\"\",VLOOKUP($A96,'EKC1'!$P$4:$AB$48,12,FALSE))","v":""},{"$f":"IF(ISNA(VLOOKUP($A96,'EKC2'!$P$4:$AB$48,12,FALSE)),\"\",VLOOKUP($A96,'EKC2'!$P$4:$AB$48,12,FALSE))","v":""},{"$f":"IF(ISNA(VLOOKUP($A96,'EKC3'!$P$4:$AB$48,12,FALSE)),\"\",VLOOKUP($A96,'EKC3'!$P$4:$AB$48,12,FALSE))","v":""},{"$f":"IF(ISNA(VLOOKUP($A96,'EKC4'!$P$4:$AB$48,12,FALSE)),\"\",VLOOKUP($A96,'EKC4'!$P$4:$AB$48,12,FALSE))","v":""},{"$f":"IF(ISNA(VLOOKUP($A96,'EKC5'!$P$4:$AB$48,12,FALSE)),\"\",VLOOKUP($A96,'EKC5'!$P$4:$AB$48,12,FALSE))","v":""},0,null,null,"",0]
[null,{"$f":"IF(ISNA(VLOOKUP($A97,'EKC1'!$P$4:$AB$48,12,FALSE)),\"\",VLOOKUP($A97,'EKC1'!$P$4:$AB$48,12,FALSE))","v":""},{"$f":"IF(ISNA(VLOOKUP($A97,'EKC2'!$P$4:$AB$48,12,FALSE)),\"\",VLOOKUP($A97,'EKC2'!$P$4:$AB$48,12,FALSE))","v":""},{"$f":"IF(ISNA(VLOOKUP($A97,'EKC3'!$P$4:$AB$48,12,FALSE)),\"\",VLOOKUP($A97,'EKC3'!$P$4:$AB$48,12,FALSE))","v":""},{"$f":"IF(ISNA(VLOOKUP($A97,'EKC4'!$P$4:$AB$48,12,FALSE)),\"\",VLOOKUP($A97,'EKC4'!$P$4:$AB$48,12,FALSE))","v":""},{"$f":"IF(ISNA(VLOOKUP($A97,'EKC5'!$P$4:$AB$48,12,FALSE)),\"\",VLOOKUP($A97,'EKC5'!$P$4:$AB$48,12,FALSE))","v":""},0,null,null,"",0]
[null,{"$f":"IF(ISNA(VLOOKUP($A98,'EKC1'!$P$4:$AB$48,12,FALSE)),\"\",VLOOKUP($A98,'EKC1'!$P$4:$AB$48,12,FALSE))","v":""},{"$f":"IF(ISNA(VLOOKUP($A98,'EKC2'!$P$4:$AB$48,12,FALSE)),\"\",VLOOKUP($A98,'EKC2'!$P$4:$AB$48,12,FALSE))","v":""},{"$f":"IF(ISNA(VLOOKUP($A98,'EKC3'!$P$4:$AB$48,12,FALSE)),\"\",VLOOKUP($A98,'EKC3'!$P$4:$AB$48,12,FALSE))","v":""},{"$f":"IF(ISNA(VLOOKUP($A98,'EKC4'!$P$4:$AB$48,12,FALSE)),\"\",VLOOKUP($A98,'EKC4'!$P$4:$AB$48,12,FALSE))","v":""},{"$f":"IF(ISNA(VLOOKUP($A98,'EKC5'!$P$4:$AB$48,12,FALSE)),\"\",VLOOKUP($A98,'EKC5'!$P$4:$AB$48,12,FALSE))","v":""},0,null,null,"",0]
[null,{"$f":"IF(ISNA(VLOOKUP($A99,'EKC1'!$P$4:$AB$48,12,FALSE)),\"\",VLOOKUP($A99,'EKC1'!$P$4:$AB$48,12,FALSE))","v":""},{"$f":"IF(ISNA(VLOOKUP($A99,'EKC2'!$P$4:$AB$48,12,FALSE)),\"\",VLOOKUP($A99,'EKC2'!$P$4:$AB$48,12,FALSE))","v":""},{"$f":"IF(ISNA(VLOOKUP($A99,'EKC3'!$P$4:$AB$48,12,FALSE)),\"\",VLOOKUP($A99,'EKC3'!$P$4:$AB$48,12,FALSE))","v":""},{"$f":"IF(ISNA(VLOOKUP($A99,'EKC4'!$P$4:$AB$48,12,FALSE)),\"\",VLOOKUP($A99,'EKC4'!$P$4:$AB$48,12,FALSE))","v":""},{"$f":"IF(ISNA(VLOOKUP($A99,'EKC5'!$P$4:$AB$48,12,FALSE)),\"\",VLOOKUP($A99,'EKC5'!$P$4:$AB$48,12,FALSE))","v":""},0,null,null,"",0]
[null,{"$f":"IF(ISNA(VLOOKUP($A100,'EKC1'!$P$4:$AB$48,12,FALSE)),\"\",VLOOKUP($A100,'EKC1'!$P$4:$AB$48,12,FALSE))","v":""},{"$f":"IF(ISNA(VLOOKUP($A100,'EKC2'!$P$4:$AB$48,12,FALSE)),\"\",VLOOKUP($A100,'EKC2'!$P$4:$AB$48,12,FALSE))","v":""},{"$f":"IF(ISNA(VLOOKUP($A100,'EKC3'!$P$4:$AB$48,12,FALSE)),\"\",VLOOKUP($A100,'EKC3'!$P$4:$AB$48,12,FALSE))","v":""},{"$f":"IF(ISNA(VLOOKUP($A100,'EKC4'!$P$4:$AB$48,12,FALSE)),\"\",VLOOKUP($A100,'EKC4'!$P$4:$AB$48,12,FALSE))","v":""},{"$f":"IF(ISNA(VLOOKUP($A100,'EKC5'!$P$4:$AB$48,12,FALSE)),\"\",VLOOKUP($A100,'EKC5'!$P$4:$AB$48,12,FALSE))","v":""},0,null,null,"",0]
[null,{"$f":"IF(ISNA(VLOOKUP($A101,'EKC1'!$P$4:$AB$48,12,FALSE)),\"\",VLOOKUP($A101,'EKC1'!$P$4:$AB$48,12,FALSE))","v":""},{"$f":"IF(ISNA(VLOOKUP($A101,'EKC2'!$P$4:$AB$48,12,FALSE)),\"\",VLOOKUP($A101,'EKC2'!$P$4:$AB$48,12,FALSE))","v":""},{"$f":"IF(ISNA(VLOOKUP($A101,'EKC3'!$P$4:$AB$48,12,FALSE)),\"\",VLOOKUP($A101,'EKC3'!$P$4:$AB$48,12,FALSE))","v":""},{"$f":"IF(ISNA(VLOOKUP($A101,'EKC4'!$P$4:$AB$48,12,FALSE)),\"\",VLOOKUP($A101,'EKC4'!$P$4:$AB$48,12,FALSE))","v":""},{"$f":"IF(ISNA(VLOOKUP($A101,'EKC5'!$P$4:$AB$48,12,FALSE)),\"\",VLOOKUP($A101,'EKC5'!$P$4:$AB$48,12,FALSE))","v":""},0,null,null,"",0]
[null,{"$f":"IF(ISNA(VLOOKUP($A102,'EKC1'!$P$4:$AB$48,12,FALSE)),\"\",VLOOKUP($A102,'EKC1'!$P$4:$AB$48,12,FALSE))","v":""},{"$f":"IF(ISNA(VLOOKUP($A102,'EKC2'!$P$4:$AB$48,12,FALSE)),\"\",VLOOKUP($A102,'EKC2'!$P$4:$AB$48,12,FALSE))","v":""},{"$f":"IF(ISNA(VLOOKUP($A102,'EKC3'!$P$4:$AB$48,12,FALSE)),\"\",VLOOKUP($A102,'EKC3'!$P$4:$AB$48,12,FALSE))","v":""},{"$f":"IF(ISNA(VLOOKUP($A102,'EKC4'!$P$4:$AB$48,12,FALSE)),\"\",VLOOKUP($A102,'EKC4'!$P$4:$AB$48,12,FALSE))","v":""},{"$f":"IF(ISNA(VLOOKUP($A102,'EKC5'!$P$4:$AB$48,12,FALSE)),\"\",VLOOKUP($A102,'EKC5'!$P$4:$AB$48,12,FALSE))","v":""},0,null,null,"",0]
[null,{"$f":"IF(ISNA(VLOOKUP($A103,'EKC1'!$P$4:$AB$48,12,FALSE)),\"\",VLOOKUP($A103,'EKC1'!$P$4:$AB$48,12,FALSE))","v":""},{"$f":"IF(ISNA(VLOOKUP($A103,'EKC2'!$P$4:$AB$48,12,FALSE)),\"\",VLOOKUP($A103,'EKC2'!$P$4:$AB$48,12,FALSE))","v":""},{"$f":"IF(ISNA(VLOOKUP($A103,'EKC3'!$P$4:$AB$48,12,FALSE)),\"\",VLOOKUP($A103,'EKC3'!$P$4:$AB$48,12,FALSE))","v":""},{"$f":"IF(ISNA(VLOOKUP($A103,'EKC4'!$P$4:$AB$48,12,FALSE)),\"\",VLOOKUP($A103,'EKC4'!$P$4:$AB$48,12,FALSE))","v":""},{"$f":"IF(ISNA(VLOOKUP($A103,'EKC5'!$P$4:$AB$48,12,FALSE)),\"\",VLOOKUP($A103,'EKC5'!$P$4:$AB$48,12,FALSE))","v":""},0,null,null,"",0]
[null,{"$f":"IF(ISNA(VLOOKUP($A104,'EKC1'!$P$4:$AB$48,12,FALSE)),\"\",VLOOKUP($A104,'EKC1'!$P$4:$AB$48,12,FALSE))","v":""},{"$f":"IF(ISNA(VLOOKUP($A104,'EKC2'!$P$4:$AB$48,12,FALSE)),\"\",VLOOKUP($A104,'EKC2'!$P$4:$AB$48,12,FALSE))","v":""},{"$f":"IF(ISNA(VLOOKUP($A104,'EKC3'!$P$4:$AB$48,12,FALSE)),\"\",VLOOKUP($A104,'EKC3'!$P$4:$AB$48,12,FALSE))","v":""},{"$f":"IF(ISNA(VLOOKUP($A104,'EKC4'!$P$4:$AB$48,12,FALSE)),\"\",VLOOKUP($A104,'EKC4'!$P$4:$AB$48,12,FALSE))","v":""},{"$f":"IF(ISNA(VLOOKUP($A104,'EKC5'!$P$4:$AB$48,12,FALSE)),\"\",VLOOKUP($A104,'EKC5'!$P$4:$AB$48,12,FALSE))","v":""},0,null,null,"",0]
[null,{"$f":"IF(ISNA(VLOOKUP($A105,'EKC1'!$P$4:$AB$48,12,FALSE)),\"\",VLOOKUP($A105,'EKC1'!$P$4:$AB$48,12,FALSE))","v":""},{"$f":"IF(ISNA(VLOOKUP($A105,'EKC2'!$P$4:$AB$48,12,FALSE)),\"\",VLOOKUP($A105,'EKC2'!$P$4:$AB$48,12,FALSE))","v":""},{"$f":"IF(ISNA(VLOOKUP($A105,'EKC3'!$P$4:$AB$48,12,FALSE)),\"\",VLOOKUP($A105,'EKC3'!$P$4:$AB$48,12,FALSE))","v":""},{"$f":"IF(ISNA(VLOOKUP($A105,'EKC4'!$P$4:$AB$48,12,FALSE)),\"\",VLOOKUP($A105,'EKC4'!$P$4:$AB$48,12,FALSE))","v":""},{"$f":"IF(ISNA(VLOOKUP($A105,'EKC5'!$P$4:$AB$48,12,FALSE)),\"\",VLOOKUP($A105,'EKC5'!$P$4:$AB$48,12,FALSE))","v":""},0,null,null,"",0]
[null,{"$f":"IF(ISNA(VLOOKUP($A106,'EKC1'!$P$4:$AB$48,12,FALSE)),\"\",VLOOKUP($A106,'EKC1'!$P$4:$AB$48,12,FALSE))","v":""},{"$f":"IF(ISNA(VLOOKUP($A106,'EKC2'!$P$4:$AB$48,12,FALSE)),\"\",VLOOKUP($A106,'EKC2'!$P$4:$AB$48,12,FALSE))","v":""},{"$f":"IF(ISNA(VLOOKUP($A106,'EKC3'!$P$4:$AB$48,12,FALSE)),\"\",VLOOKUP($A106,'EKC3'!$P$4:$AB$48,12,FALSE))","v":""},{"$f":"IF(ISNA(VLOOKUP($A106,'EKC4'!$P$4:$AB$48,12,FALSE)),\"\",VLOOKUP($A106,'EKC4'!$P$4:$AB$48,12,FALSE))","v":""},{"$f":"IF(ISNA(VLOOKUP($A106,'EKC5'!$P$4:$AB$48,12,FALSE)),\"\",VLOOKUP($A106,'EKC5'!$P$4:$AB$48,12,FALSE))","v":""},0,null,null,"",0]
[null,{"$f":"IF(ISNA(VLOOKUP($A107,'EKC1'!$P$4:$AB$48,12,FALSE)),\"\",VLOOKUP($A107,'EKC1'!$P$4:$AB$48,12,FALSE))","v":""},{"$f":"IF(ISNA(VLOOKUP($A107,'EKC2'!$P$4:$AB$48,12,FALSE)),\"\",VLOOKUP($A107,'EKC2'!$P$4:$AB$48,12,FALSE))","v":""},{"$f":"IF(ISNA(VLOOKUP($A107,'EKC3'!$P$4:$AB$48,12,FALSE)),\"\",VLOOKUP($A107,'EKC3'!$P$4:$AB$48,12,FALSE))","v":""},{"$f":"IF(ISNA(VLOOKUP($A107,'EKC4'!$P$4:$AB$48,12,FALSE)),\"\",VLOOKUP($A107,'EKC4'!$P$4:$AB$48,12,FALSE))","v":""},{"$f":"IF(ISNA(VLOOKUP($A107,'EKC5'!$P$4:$AB$48,12,FALSE)),\"\",VLOOKUP($A107,'EKC5'!$P$4:$AB$48,12,FALSE))","v":""},0,null,null,"",0]
[null,{"$f":"IF(ISNA(VLOOKUP($A108,'EKC1'!$P$4:$AB$48,12,FALSE)),\"\",VLOOKUP($A108,'EKC1'!$P$4:$AB$48,12,FALSE))","v":""},{"$f":"IF(ISNA(VLOOKUP($A108,'EKC2'!$P$4:$AB$48,12,FALSE)),\"\",VLOOKUP($A108,'EKC2'!$P$4:$AB$48,12,FALSE))","v":""},{"$f":"IF(ISNA(VLOOKUP($A108,'EKC3'!$P$4:$AB$48,12,FALSE)),\"\",VLOOKUP($A108,'EKC3'!$P$4:$AB$48,12,FALSE))","v":""},{"$f":"IF(ISNA(VLOOKUP($A108,'EKC4'!$P$4:$AB$48,12,FALSE)),\"\",VLOOKUP($A108,'EKC4'!$P$4:$AB$48,12,FALSE))","v":""},{"$f":"IF(ISNA(VLOOKUP($A108,'EKC5'!$P$4:$AB$48,12,FALSE)),\"\",VLOOKUP($A108,'EKC5'!$P$4:$AB$48,12,FALSE))","v":""},0,null,null,"",0]
[null,{"$f":"IF(ISNA(VLOOKUP($A109,'EKC1'!$P$4:$AB$48,12,FALSE)),\"\",VLOOKUP($A109,'EKC1'!$P$4:$AB$48,12,FALSE))","v":""},{"$f":"IF(ISNA(VLOOKUP($A109,'EKC2'!$P$4:$AB$48,12,FALSE)),\"\",VLOOKUP($A109,'EKC2'!$P$4:$AB$48,12,FALSE))","v":""},{"$f":"IF(ISNA(VLOOKUP($A109,'EKC3'!$P$4:$AB$48,12,FALSE)),\"\",VLOOKUP($A109,'EKC3'!$P$4:$AB$48,12,FALSE))","v":""},{"$f":"IF(ISNA(VLOOKUP($A109,'EKC4'!$P$4:$AB$48,12,FALSE)),\"\",VLOOKUP($A109,'EKC4'!$P$4:$AB$48,12,FALSE))","v":""},{"$f":"IF(ISNA(VLOOKUP($A109,'EKC5'!$P$4:$AB$48,12,FALSE)),\"\",VLOOKUP($A109,'EKC5'!$P$4:$AB$48,12,FALSE))","v":""},0,null,null,"",0]
[null,{"$f":"IF(ISNA(VLOOKUP($A110,'EKC1'!$P$4:$AB$48,12,FALSE)),\"\",VLOOKUP($A110,'EKC1'!$P$4:$AB$48,12,FALSE))","v":""},{"$f":"IF(ISNA(VLOOKUP($A110,'EKC2'!$P$4:$AB$48,12,FALSE)),\"\",VLOOKUP($A110,'EKC2'!$P$4:$AB$48,12,FALSE))","v":""},{"$f":"IF(ISNA(VLOOKUP($A110,'EKC3'!$P$4:$AB$48,12,FALSE)),\"\",VLOOKUP($A110,'EKC3'!$P$4:$AB$48,12,FALSE))","v":""},{"$f":"IF(ISNA(VLOOKUP($A110,'EKC4'!$P$4:$AB$48,12,FALSE)),\"\",VLOOKUP($A110,'EKC4'!$P$4:$AB$48,12,FALSE))","v":""},{"$f":"IF(ISNA(VLOOKUP($A110,'EKC5'!$P$4:$AB$48,12,FALSE)),\"\",VLOOKUP($A110,'EKC5'!$P$4:$AB$48,12,FALSE))","v":""},0,null,null,"",0]
[null,{"$f":"IF(ISNA(VLOOKUP($A111,'EKC1'!$P$4:$AB$48,12,FALSE)),\"\",VLOOKUP($A111,'EKC1'!$P$4:$AB$48,12,FALSE))","v":""},{"$f":"IF(ISNA(VLOOKUP($A111,'EKC2'!$P$4:$AB$48,12,FALSE)),\"\",VLOOKUP($A111,'EKC2'!$P$4:$AB$48,12,FALSE))","v":""},{"$f":"IF(ISNA(VLOOKUP($A111,'EKC3'!$P$4:$AB$48,12,FALSE)),\"\",VLOOKUP($A111,'EKC3'!$P$4:$AB$48,12,FALSE))","v":""},{"$f":"IF(ISNA(VLOOKUP($A111,'EKC4'!$P$4:$AB$48,12,FALSE)),\"\",VLOOKUP($A111,'EKC4'!$P$4:$AB$48,12,FALSE))","v":""},{"$f":"IF(ISNA(VLOOKUP($A111,'EKC5'!$P$4:$AB$48,12,FALSE)),\"\",VLOOKUP($A111,'EKC5'!$P$4:$AB$48,12,FALSE))","v":""},0,null,null,"",0]
[null,{"$f":"IF(ISNA(VLOOKUP($A112,'EKC1'!$P$4:$AB$48,12,FALSE)),\"\",VLOOKUP($A112,'EKC1'!$P$4:$AB$48,12,FALSE))","v":""},{"$f":"IF(ISNA(VLOOKUP($A112,'EKC2'!$P$4:$AB$48,12,FALSE)),\"\",VLOOKUP($A112,'EKC2'!$P$4:$AB$48,12,FALSE))","v":""},{"$f":"IF(ISNA(VLOOKUP($A112,'EKC3'!$P$4:$AB$48,12,FALSE)),\"\",VLOOKUP($A112,'EKC3'!$P$4:$AB$48,12,FALSE))","v":""},{"$f":"IF(ISNA(VLOOKUP($A112,'EKC4'!$P$4:$AB$48,12,FALSE)),\"\",VLOOKUP($A112,'EKC4'!$P$4:$AB$48,12,FALSE))","v":""},{"$f":"IF(ISNA(VLOOKUP($A112,'EKC5'!$P$4:$AB$48,12,FALSE)),\"\",VLOOKUP($A112,'EKC5'!$P$4:$AB$48,12,FALSE))","v":""},0,null,null,"",0]
[null,{"$f":"IF(ISNA(VLOOKUP($A113,'EKC1'!$P$4:$AB$48,12,FALSE)),\"\",VLOOKUP($A113,'EKC1'!$P$4:$AB$48,12,FALSE))","v":""},{"$f":"IF(ISNA(VLOOKUP($A113,'EKC2'!$P$4:$AB$48,12,FALSE)),\"\",VLOOKUP($A113,'EKC2'!$P$4:$AB$48,12,FALSE))","v":""},{"$f":"IF(ISNA(VLOOKUP($A113,'EKC3'!$P$4:$AB$48,12,FALSE)),\"\",VLOOKUP($A113,'EKC3'!$P$4:$AB$48,12,FALSE))","v":""},{"$f":"IF(ISNA(VLOOKUP($A113,'EKC4'!$P$4:$AB$48,12,FALSE)),\"\",VLOOKUP($A113,'EKC4'!$P$4:$AB$48,12,FALSE))","v":""},{"$f":"IF(ISNA(VLOOKUP($A113,'EKC5'!$P$4:$AB$48,12,FALSE)),\"\",VLOOKUP($A113,'EKC5'!$P$4:$AB$48,12,FALSE))","v":""},0,null,null,"",0]
[null,{"$f":"IF(ISNA(VLOOKUP($A114,'EKC1'!$P$4:$AB$48,12,FALSE)),\"\",VLOOKUP($A114,'EKC1'!$P$4:$AB$48,12,FALSE))","v":""},{"$f":"IF(ISNA(VLOOKUP($A114,'EKC2'!$P$4:$AB$48,12,FALSE)),\"\",VLOOKUP($A114,'EKC2'!$P$4:$AB$48,12,FALSE))","v":""},{"$f":"IF(ISNA(VLOOKUP($A114,'EKC3'!$P$4:$AB$48,12,FALSE)),\"\",VLOOKUP($A114,'EKC3'!$P$4:$AB$48,12,FALSE))","v":""},{"$f":"IF(ISNA(VLOOKUP($A114,'EKC4'!$P$4:$AB$48,12,FALSE)),\"\",VLOOKUP($A114,'EKC4'!$P$4:$AB$48,12,FALSE))","v":""},{"$f":"IF(ISNA(VLOOKUP($A114,'EKC5'!$P$4:$AB$48,12,FALSE)),\"\",VLOOKUP($A114,'EKC5'!$P$4:$AB$48,12,FALSE))","v":""},0,null,null,"",0]
[null,{"$f":"IF(ISNA(VLOOKUP($A115,'EKC1'!$P$4:$AB$48,12,FALSE)),\"\",VLOOKUP($A115,'EKC1'!$P$4:$AB$48,12,FALSE))","v":""},{"$f":"IF(ISNA(VLOOKUP($A115,'EKC2'!$P$4:$AB$48,12,FALSE)),\"\",VLOOKUP($A115,'EKC2'!$P$4:$AB$48,12,FALSE))","v":""},{"$f":"IF(ISNA(VLOOKUP($A115,'EKC3'!$P$4:$AB$48,12,FALSE)),\"\",VLOOKUP($A115,'EKC3'!$P$4:$AB$48,12,FALSE))","v":""},{"$f":"IF(ISNA(VLOOKUP($A115,'EKC4'!$P$4:$AB$48,12,FALSE)),\"\",VLOOKUP($A115,'EKC4'!$P$4:$AB$48,12,FALSE))","v":""},{"$f":"IF(ISNA(VLOOKUP($A115,'EKC5'!$P$4:$AB$48,12,FALSE)),\"\",VLOOKUP($A115,'EKC5'!$P$4:$AB$48,12,FALSE))","v":""},0,null,null,"",0]
[null,{"$f":"IF(ISNA(VLOOKUP($A116,'EKC1'!$P$4:$AB$48,12,FALSE)),\"\",VLOOKUP($A116,'EKC1'!$P$4:$AB$48,12,FALSE))","v":""},{"$f":"IF(ISNA(VLOOKUP($A116,'EKC2'!$P$4:$AB$48,12,FALSE)),\"\",VLOOKUP($A116,'EKC2'!$P$4:$AB$48,12,FALSE))","v":""},{"$f":"IF(ISNA(VLOOKUP($A116,'EKC3'!$P$4:$AB$48,12,FALSE)),\"\",VLOOKUP($A116,'EKC3'!$P$4:$AB$48,12,FALSE))","v":""},{"$f":"IF(ISNA(VLOOKUP($A116,'EKC4'!$P$4:$AB$48,12,FALSE)),\"\",VLOOKUP($A116,'EKC4'!$P$4:$AB$48,12,FALSE))","v":""},{"$f":"IF(ISNA(VLOOKUP($A116,'EKC5'!$P$4:$AB$48,12,FALSE)),\"\",VLOOKUP($A116,'EKC5'!$P$4:$AB$48,12,FALSE))","v":""},0,null,null,"",0]
[null,{"$f":"IF(ISNA(VLOOKUP($A117,'EKC1'!$P$4:$AB$48,12,FALSE)),\"\",VLOOKUP($A117,'EKC1'!$P$4:$AB$48,12,FALSE))","v":""},{"$f":"IF(ISNA(VLOOKUP($A117,'EKC2'!$P$4:$AB$48,12,FALSE)),\"\",VLOOKUP($A117,'EKC2'!$P$4:$AB$48,12,FALSE))","v":""},{"$f":"IF(ISNA(VLOOKUP($A117,'EKC3'!$P$4:$AB$48,12,FALSE)),\"\",VLOOKUP($A117,'EKC3'!$P$4:$AB$48,12,FALSE))","v":""},{"$f":"IF(ISNA(VLOOKUP($A117,'EKC4'!$P$4:$AB$48,12,FALSE)),\"\",VLOOKUP($A117,'EKC4'!$P$4:$AB$48,12,FALSE))","v":""},{"$f":"IF(ISNA(VLOOKUP($A117,'EKC5'!$P$4:$AB$48,12,FALSE)),\"\",VLOOKUP($A117,'EKC5'!$P$4:$AB$48,12,FALSE))","v":""},0,null,null,"",0]
[null,{"$f":"IF(ISNA(VLOOKUP($A118,'EKC1'!$P$4:$AB$48,12,FALSE)),\"\",VLOOKUP($A118,'EKC1'!$P$4:$AB$48,12,FALSE))","v":""},{"$f":"IF(ISNA(VLOOKUP($A118,'EKC2'!$P$4:$AB$48,12,FALSE)),\"\",VLOOKUP($A118,'EKC2'!$P$4:$AB$48,12,FALSE))","v":""},{"$f":"IF(ISNA(VLOOKUP($A118,'EKC3'!$P$4:$AB$48,12,FALSE)),\"\",VLOOKUP($A118,'EKC3'!$P$4:$AB$48,12,FALSE))","v":""},{"$f":"IF(ISNA(VLOOKUP($A118,'EKC4'!$P$4:$AB$48,12,FALSE)),\"\",VLOOKUP($A118,'EKC4'!$P$4:$AB$48,12,FALSE))","v":""},{"$f":"IF(ISNA(VLOOKUP($A118,'EKC5'!$P$4:$AB$48,12,FALSE)),\"\",VLOOKUP($A118,'EKC5'!$P$4:$AB$48,12,FALSE))","v":""},0,null,null,"",0]
[null,{"$f":"IF(ISNA(VLOOKUP($A119,'EKC1'!$P$4:$AB$48,12,FALSE)),\"\",VLOOKUP($A119,'EKC1'!$P$4:$AB$48,12,FALSE))","v":""},{"$f":"IF(ISNA(VLOOKUP($A119,'EKC2'!$P$4:$AB$48,12,FALSE)),\"\",VLOOKUP($A119,'EKC2'!$P$4:$AB$48,12,FALSE))","v":""},{"$f":"IF(ISNA(VLOOKUP($A119,'EKC3'!$P$4:$AB$48,12,FALSE)),\"\",VLOOKUP($A119,'EKC3'!$P$4:$AB$48,12,FALSE))","v":""},{"$f":"IF(ISNA(VLOOKUP($A119,'EKC4'!$P$4:$AB$48,12,FALSE)),\"\",VLOOKUP($A119,'EKC4'!$P$4:$AB$48,12,FALSE))","v":""},{"$f":"IF(ISNA(VLOOKUP($A119,'EKC5'!$P$4:$AB$48,12,FALSE)),\"\",VLOOKUP($A119,'EKC5'!$P$4:$AB$48,12,FALSE))","v":""},0,null,null,"",0]
[null,{"$f":"IF(ISNA(VLOOKUP($A120,'EKC1'!$P$4:$AB$48,12,FALSE)),\"\",VLOOKUP($A120,'EKC1'!$P$4:$AB$48,12,FALSE))","v":""},{"$f":"IF(ISNA(VLOOKUP($A120,'EKC2'!$P$4:$AB$48,12,FALSE)),\"\",VLOOKUP($A120,'EKC2'!$P$4:$AB$48,12,FALSE))","v":""},{"$f":"IF(ISNA(VLOOKUP($A120,'EKC3'!$P$4:$AB$48,12,FALSE)),\"\",VLOOKUP($A120,'EKC3'!$P$4:$AB$48,12,FALSE))","v":""},{"$f":"IF(ISNA(VLOOKUP($A120,'EKC4'!$P$4:$AB$48,12,FALSE)),\"\",VLOOKUP($A120,'EKC4'!$P$4:$AB$48,12,FALSE))","v":""},{"$f":"IF(ISNA(VLOOKUP($A120,'EKC5'!$P$4:$AB$48,12,FALSE)),\"\",VLOOKUP($A120,'EKC5'!$P$4:$AB$48,12,FALSE))","v":""},0,null,null,"",0]
[null,{"$f":"IF(ISNA(VLOOKUP($A121,'EKC1'!$P$4:$AB$48,12,FALSE)),\"\",VLOOKUP($A121,'EKC1'!$P$4:$AB$48,12,FALSE))","v":""},{"$f":"IF(ISNA(VLOOKUP($A121,'EKC2'!$P$4:$AB$48,12,FALSE)),\"\",VLOOKUP($A121,'EKC2'!$P$4:$AB$48,12,FALSE))","v":""},{"$f":"IF(ISNA(VLOOKUP($A121,'EKC3'!$P$4:$AB$48,12,FALSE)),\"\",VLOOKUP($A121,'EKC3'!$P$4:$AB$48,12,FALSE))","v":""},{"$f":"IF(ISNA(VLOOKUP($A121,'EKC4'!$P$4:$AB$48,12,FALSE)),\"\",VLOOKUP($A121,'EKC4'!$P$4:$AB$48,12,FALSE))","v":""},{"$f":"IF(ISNA(VLOOKUP($A121,'EKC5'!$P$4:$AB$48,12,FALSE)),\"\",VLOOKUP($A121,'EKC5'!$P$4:$AB$48,12,FALSE))","v":""},0,null,null,"",0]
[null,{"$f":"IF(ISNA(VLOOKUP($A122,'EKC1'!$P$4:$AB$48,12,FALSE)),\"\",VLOOKUP($A122,'EKC1'!$P$4:$AB$48,12,FALSE))","v":""},{"$f":"IF(ISNA(VLOOKUP($A122,'EKC2'!$P$4:$AB$48,12,FALSE)),\"\",VLOOKUP($A122,'EKC2'!$P$4:$AB$48,12,FALSE))","v":""},{"$f":"IF(ISNA(VLOOKUP($A122,'EKC3'!$P$4:$AB$48,12,FALSE)),\"\",VLOOKUP($A122,'EKC3'!$P$4:$AB$48,12,FALSE))","v":""},{"$f":"IF(ISNA(VLOOKUP($A122,'EKC4'!$P$4:$AB$48,12,FALSE)),\"\",VLOOKUP($A122,'EKC4'!$P$4:$AB$48,12,FALSE))","v":""},{"$f":"IF(ISNA(VLOOKUP($A122,'EKC5'!$P$4:$AB$48,12,FALSE)),\"\",VLOOKUP($A122,'EKC5'!$P$4:$AB$48,12,FALSE))","v":""},0,null,null,"",0]
[null,{"$f":"IF(ISNA(VLOOKUP($A123,'EKC1'!$P$4:$AB$48,12,FALSE)),\"\",VLOOKUP($A123,'EKC1'!$P$4:$AB$48,12,FALSE))","v":""},{"$f":"IF(ISNA(VLOOKUP($A123,'EKC2'!$P$4:$AB$48,12,FALSE)),\"\",VLOOKUP($A123,'EKC2'!$P$4:$AB$48,12,FALSE))","v":""},{"$f":"IF(ISNA(VLOOKUP($A123,'EKC3'!$P$4:$AB$48,12,FALSE)),\"\",VLOOKUP($A123,'EKC3'!$P$4:$AB$48,12,FALSE))","v":""},{"$f":"IF(ISNA(VLOOKUP($A123,'EKC4'!$P$4:$AB$48,12,FALSE)),\"\",VLOOKUP($A123,'EKC4'!$P$4:$AB$48,12,FALSE))","v":""},{"$f":"IF(ISNA(VLOOKUP($A123,'EKC5'!$P$4:$AB$48,12,FALSE)),\"\",VLOOKUP($A123,'EKC5'!$P$4:$AB$48,12,FALSE))","v":""},0,null,null,"",0]
[null,{"$f":"IF(ISNA(VLOOKUP($A124,'EKC1'!$P$4:$AB$48,12,FALSE)),\"\",VLOOKUP($A124,'EKC1'!$P$4:$AB$48,12,FALSE))","v":""},{"$f":"IF(ISNA(VLOOKUP($A124,'EKC2'!$P$4:$AB$48,12,FALSE)),\"\",VLOOKUP($A124,'EKC2'!$P$4:$AB$48,12,FALSE))","v":""},{"$f":"IF(ISNA(VLOOKUP($A124,'EKC3'!$P$4:$AB$48,12,FALSE)),\"\",VLOOKUP($A124,'EKC3'!$P$4:$AB$48,12,FALSE))","v":""},{"$f":"IF(ISNA(VLOOKUP($A124,'EKC4'!$P$4:$AB$48,12,FALSE)),\"\",VLOOKUP($A124,'EKC4'!$P$4:$AB$48,12,FALSE))","v":""},{"$f":"IF(ISNA(VLOOKUP($A124,'EKC5'!$P$4:$AB$48,12,FALSE)),\"\",VLOOKUP($A124,'EKC5'!$P$4:$AB$48,12,FALSE))","v":""},0,null,null,"",0]
[null,{"$f":"IF(ISNA(VLOOKUP($A125,'EKC1'!$P$4:$AB$48,12,FALSE)),\"\",VLOOKUP($A125,'EKC1'!$P$4:$AB$48,12,FALSE))","v":""},{"$f":"IF(ISNA(VLOOKUP($A125,'EKC2'!$P$4:$AB$48,12,FALSE)),\"\",VLOOKUP($A125,'EKC2'!$P$4:$AB$48,12,FALSE))","v":""},{"$f":"IF(ISNA(VLOOKUP($A125,'EKC3'!$P$4:$AB$48,12,FALSE)),\"\",VLOOKUP($A125,'EKC3'!$P$4:$AB$48,12,FALSE))","v":""},{"$f":"IF(ISNA(VLOOKUP($A125,'EKC4'!$P$4:$AB$48,12,FALSE)),\"\",VLOOKUP($A125,'EKC4'!$P$4:$AB$48,12,FALSE))","v":""},{"$f":"IF(ISNA(VLOOKUP($A125,'EKC5'!$P$4:$AB$48,12,FALSE)),\"\",VLOOKUP($A125,'EKC5'!$P$4:$AB$48,12,FALSE))","v":""},0,null,null,"",0]
[null,{"$f":"IF(ISNA(VLOOKUP($A126,'EKC1'!$P$4:$AB$48,12,FALSE)),\"\",VLOOKUP($A126,'EKC1'!$P$4:$AB$48,12,FALSE))","v":""},{"$f":"IF(ISNA(VLOOKUP($A126,'EKC2'!$P$4:$AB$48,12,FALSE)),\"\",VLOOKUP($A126,'EKC2'!$P$4:$AB$48,12,FALSE))","v":""},{"$f":"IF(ISNA(VLOOKUP($A126,'EKC3'!$P$4:$AB$48,12,FALSE)),\"\",VLOOKUP($A126,'EKC3'!$P$4:$AB$48,12,FALSE))","v":""},{"$f":"IF(ISNA(VLOOKUP($A126,'EKC4'!$P$4:$AB$48,12,FALSE)),\"\",VLOOKUP($A126,'EKC4'!$P$4:$AB$48,12,FALSE))","v":""},{"$f":"IF(ISNA(VLOOKUP($A126,'EKC5'!$P$4:$AB$48,12,FALSE)),\"\",VLOOKUP($A126,'EKC5'!$P$4:$AB$48,12,FALSE))","v":""},0,null,null,"",0]
[null,{"$f":"IF(ISNA(VLOOKUP($A127,'EKC1'!$P$4:$AB$48,12,FALSE)),\"\",VLOOKUP($A127,'EKC1'!$P$4:$AB$48,12,FALSE))","v":""},{"$f":"IF(ISNA(VLOOKUP($A127,'EKC2'!$P$4:$AB$48,12,FALSE)),\"\",VLOOKUP($A127,'EKC2'!$P$4:$AB$48,12,FALSE))","v":""},{"$f":"IF(ISNA(VLOOKUP($A127,'EKC3'!$P$4:$AB$48,12,FALSE)),\"\",VLOOKUP($A127,'EKC3'!$P$4:$AB$48,12,FALSE))","v":""},{"$f":"IF(ISNA(VLOOKUP($A127,'EKC4'!$P$4:$AB$48,12,FALSE)),\"\",VLOOKUP($A127,'EKC4'!$P$4:$AB$48,12,FALSE))","v":""},{"$f":"IF(ISNA(VLOOKUP($A127,'EKC5'!$P$4:$AB$48,12,FALSE)),\"\",VLOOKUP($A127,'EKC5'!$P$4:$AB$48,12,FALSE))","v":""},0,null,null,"",0]
[null,{"$f":"IF(ISNA(VLOOKUP($A128,'EKC1'!$P$4:$AB$48,12,FALSE)),\"\",VLOOKUP($A128,'EKC1'!$P$4:$AB$48,12,FALSE))","v":""},{"$f":"IF(ISNA(VLOOKUP($A128,'EKC2'!$P$4:$AB$48,12,FALSE)),\"\",VLOOKUP($A128,'EKC2'!$P$4:$AB$48,12,FALSE))","v":""},{"$f":"IF(ISNA(VLOOKUP($A128,'EKC3'!$P$4:$AB$48,12,FALSE)),\"\",VLOOKUP($A128,'EKC3'!$P$4:$AB$48,12,FALSE))","v":""},{"$f":"IF(ISNA(VLOOKUP($A128,'EKC4'!$P$4:$AB$48,12,FALSE)),\"\",VLOOKUP($A128,'EKC4'!$P$4:$AB$48,12,FALSE))","v":""},{"$f":"IF(ISNA(VLOOKUP($A128,'EKC5'!$P$4:$AB$48,12,FALSE)),\"\",VLOOKUP($A128,'EKC5'!$P$4:$AB$48,12,FALSE))","v":""},0,null,null,"",0]
[null,{"$f":"IF(ISNA(VLOOKUP($A129,'EKC1'!$P$4:$AB$48,12,FALSE)),\"\",VLOOKUP($A129,'EKC1'!$P$4:$AB$48,12,FALSE))","v":""},{"$f":"IF(ISNA(VLOOKUP($A129,'EKC2'!$P$4:$AB$48,12,FALSE)),\"\",VLOOKUP($A129,'EKC2'!$P$4:$AB$48,12,FALSE))","v":""},{"$f":"IF(ISNA(VLOOKUP($A129,'EKC3'!$P$4:$AB$48,12,FALSE)),\"\",VLOOKUP($A129,'EKC3'!$P$4:$AB$48,12,FALSE))","v":""},{"$f":"IF(ISNA(VLOOKUP($A129,'EKC4'!$P$4:$AB$48,12,FALSE)),\"\",VLOOKUP($A129,'EKC4'!$P$4:$AB$48,12,FALSE))","v":""},{"$f":"IF(ISNA(VLOOKUP($A129,'EKC5'!$P$4:$AB$48,12,FALSE)),\"\",VLOOKUP($A129,'EKC5'!$P$4:$AB$48,12,FALSE))","v":""},0,null,null,"",0]
[null,{"$f":"IF(ISNA(VLOOKUP($A130,'EKC1'!$P$4:$AB$48,12,FALSE)),\"\",VLOOKUP($A130,'EKC1'!$P$4:$AB$48,12,FALSE))","v":""},{"$f":"IF(ISNA(VLOOKUP($A130,'EKC2'!$P$4:$AB$48,12,FALSE)),\"\",VLOOKUP($A130,'EKC2'!$P$4:$AB$48,12,FALSE))","v":""},{"$f":"IF(ISNA(VLOOKUP($A130,'EKC3'!$P$4:$AB$48,12,FALSE)),\"\",VLOOKUP($A130,'EKC3'!$P$4:$AB$48,12,FALSE))","v":""},{"$f":"IF(ISNA(VLOOKUP($A130,'EKC4'!$P$4:$AB$48,12,FALSE)),\"\",VLOOKUP($A130,'EKC4'!$P$4:$AB$48,12,FALSE))","v":""},{"$f":"IF(ISNA(VLOOKUP($A130,'EKC5'!$P$4:$AB$48,12,FALSE)),\"\",VLOOKUP($A130,'EKC5'!$P$4:$AB$48,12,FALSE))","v":""},0,null,null,"",0]
[null,{"$f":"IF(ISNA(VLOOKUP($A131,'EKC1'!$P$4:$AB$48,12,FALSE)),\"\",VLOOKUP($A131,'EKC1'!$P$4:$AB$48,12,FALSE))","v":""},{"$f":"IF(ISNA(VLOOKUP($A131,'EKC2'!$P$4:$AB$48,12,FALSE)),\"\",VLOOKUP($A131,'EKC2'!$P$4:$AB$48,12,FALSE))","v":""},{"$f":"IF(ISNA(VLOOKUP($A131,'EKC3'!$P$4:$AB$48,12,FALSE)),\"\",VLOOKUP($A131,'EKC3'!$P$4:$AB$48,12,FALSE))","v":""},{"$f":"IF(ISNA(VLOOKUP($A131,'EKC4'!$P$4:$AB$48,12,FALSE)),\"\",VLOOKUP($A131,'EKC4'!$P$4:$AB$48,12,FALSE))","v":""},{"$f":"IF(ISNA(VLOOKUP($A131,'EKC5'!$P$4:$AB$48,12,FALSE)),\"\",VLOOKUP($A131,'EKC5'!$P$4:$AB$48,12,FALSE))","v":""},0,null,null,"",0]
[null,{"$f":"IF(ISNA(VLOOKUP($A132,'EKC1'!$P$4:$AB$48,12,FALSE)),\"\",VLOOKUP($A132,'EKC1'!$P$4:$AB$48,12,FALSE))","v":""},{"$f":"IF(ISNA(VLOOKUP($A132,'EKC2'!$P$4:$AB$48,12,FALSE)),\"\",VLOOKUP($A132,'EKC2'!$P$4:$AB$48,12,FALSE))","v":""},{"$f":"IF(ISNA(VLOOKUP($A132,'EKC3'!$P$4:$AB$48,12,FALSE)),\"\",VLOOKUP($A132,'EKC3'!$P$4:$AB$48,12,FALSE))","v":""},{"$f":"IF(ISNA(VLOOKUP($A132,'EKC4'!$P$4:$AB$48,12,FALSE)),\"\",VLOOKUP($A132,'EKC4'!$P$4:$AB$48,12,FALSE))","v":""},{"$f":"IF(ISNA(VLOOKUP($A132,'EKC5'!$P$4:$AB$48,12,FALSE)),\"\",VLOOKUP($A132,'EKC5'!$P$4:$AB$48,12,FALSE))","v":""},{"$f":"IF(SUM(B132:F132)=0,0,SUM(B132:F132))","v":0},null,null,{"$f":"IF(ISBLANK(A132),\"\",IF(A133=A132,1,\"\"))","v":""},0]
[null,{"$f":"IF(ISNA(VLOOKUP($A133,'EKC1'!$P$4:$AB$48,12,FALSE)),\"\",VLOOKUP($A133,'EKC1'!$P$4:$AB$48,12,FALSE))","v":""},{"$f":"IF(ISNA(VLOOKUP($A133,'EKC2'!$P$4:$AB$48,12,FALSE)),\"\",VLOOKUP($A133,'EKC2'!$P$4:$AB$48,12,FALSE))","v":""},{"$f":"IF(ISNA(VLOOKUP($A133,'EKC3'!$P$4:$AB$48,12,FALSE)),\"\",VLOOKUP($A133,'EKC3'!$P$4:$AB$48,12,FALSE))","v":""},{"$f":"IF(ISNA(VLOOKUP($A133,'EKC4'!$P$4:$AB$48,12,FALSE)),\"\",VLOOKUP($A133,'EKC4'!$P$4:$AB$48,12,FALSE))","v":""},{"$f":"IF(ISNA(VLOOKUP($A133,'EKC5'!$P$4:$AB$48,12,FALSE)),\"\",VLOOKUP($A133,'EKC5'!$P$4:$AB$48,12,FALSE))","v":""},0,null,null,"",0]
[null,{"$f":"IF(ISNA(VLOOKUP($A134,'EKC1'!$P$4:$AB$48,12,FALSE)),\"\",VLOOKUP($A134,'EKC1'!$P$4:$AB$48,12,FALSE))","v":""},{"$f":"IF(ISNA(VLOOKUP($A134,'EKC2'!$P$4:$AB$48,12,FALSE)),\"\",VLOOKUP($A134,'EKC2'!$P$4:$AB$48,12,FALSE))","v":""},{"$f":"IF(ISNA(VLOOKUP($A134,'EKC3'!$P$4:$AB$48,12,FALSE)),\"\",VLOOKUP($A134,'EKC3'!$P$4:$AB$48,12,FALSE))","v":""},{"$f":"IF(ISNA(VLOOKUP($A134,'EKC4'!$P$4:$AB$48,12,FALSE)),\"\",VLOOKUP($A134,'EKC4'!$P$4:$AB$48,12,FALSE))","v":""},{"$f":"IF(ISNA(VLOOKUP($A134,'EKC5'!$P$4:$AB$48,12,FALSE)),\"\",VLOOKUP($A134,'EKC5'!$P$4:$AB$48,12,FALSE))","v":""},0,null,null,"",0]
[null,{"$f":"IF(ISNA(VLOOKUP($A135,'EKC1'!$P$4:$AB$48,12,FALSE)),\"\",VLOOKUP($A135,'EKC1'!$P$4:$AB$48,12,FALSE))","v":""},{"$f":"IF(ISNA(VLOOKUP($A135,'EKC2'!$P$4:$AB$48,12,FALSE)),\"\",VLOOKUP($A135,'EKC2'!$P$4:$AB$48,12,FALSE))","v":""},{"$f":"IF(ISNA(VLOOKUP($A135,'EKC3'!$P$4:$AB$48,12,FALSE)),\"\",VLOOKUP($A135,'EKC3'!$P$4:$AB$48,12,FALSE))","v":""},{"$f":"IF(ISNA(VLOOKUP($A135,'EKC4'!$P$4:$AB$48,12,FALSE)),\"\",VLOOKUP($A135,'EKC4'!$P$4:$AB$48,12,FALSE))","v":""},{"$f":"IF(ISNA(VLOOKUP($A135,'EKC5'!$P$4:$AB$48,12,FALSE)),\"\",VLOOKUP($A135,'EKC5'!$P$4:$AB$48,12,FALSE))","v":""},0,null,null,"",0]
[null,{"$f":"IF(ISNA(VLOOKUP($A136,'EKC1'!$P$4:$AB$48,12,FALSE)),\"\",VLOOKUP($A136,'EKC1'!$P$4:$AB$48,12,FALSE))","v":""},{"$f":"IF(ISNA(VLOOKUP($A136,'EKC2'!$P$4:$AB$48,12,FALSE)),\"\",VLOOKUP($A136,'EKC2'!$P$4:$AB$48,12,FALSE))","v":""},{"$f":"IF(ISNA(VLOOKUP($A136,'EKC3'!$P$4:$AB$48,12,FALSE)),\"\",VLOOKUP($A136,'EKC3'!$P$4:$AB$48,12,FALSE))","v":""},{"$f":"IF(ISNA(VLOOKUP($A136,'EKC4'!$P$4:$AB$48,12,FALSE)),\"\",VLOOKUP($A136,'EKC4'!$P$4:$AB$48,12,FALSE))","v":""},{"$f":"IF(ISNA(VLOOKUP($A136,'EKC5'!$P$4:$AB$48,12,FALSE)),\"\",VLOOKUP($A136,'EKC5'!$P$4:$AB$48,12,FALSE))","v":""},0,null,null,"",0]
[null,{"$f":"IF(ISNA(VLOOKUP($A137,'EKC1'!$P$4:$AB$48,12,FALSE)),\"\",VLOOKUP($A137,'EKC1'!$P$4:$AB$48,12,FALSE))","v":""},{"$f":"IF(ISNA(VLOOKUP($A137,'EKC2'!$P$4:$AB$48,12,FALSE)),\"\",VLOOKUP($A137,'EKC2'!$P$4:$AB$48,12,FALSE))","v":""},{"$f":"IF(ISNA(VLOOKUP($A137,'EKC3'!$P$4:$AB$48,12,FALSE)),\"\",VLOOKUP($A137,'EKC3'!$P$4:$AB$48,12,FALSE))","v":""},{"$f":"IF(ISNA(VLOOKUP($A137,'EKC4'!$P$4:$AB$48,12,FALSE)),\"\",VLOOKUP($A137,'EKC4'!$P$4:$AB$48,12,FALSE))","v":""},{"$f":"IF(ISNA(VLOOKUP($A137,'EKC5'!$P$4:$AB$48,12,FALSE)),\"\",VLOOKUP($A137,'EKC5'!$P$4:$AB$48,12,FALSE))","v":""},0,null,null,"",0]
[null,{"$f":"IF(ISNA(VLOOKUP($A138,'EKC1'!$P$4:$AB$48,12,FALSE)),\"\",VLOOKUP($A138,'EKC1'!$P$4:$AB$48,12,FALSE))","v":""},{"$f":"IF(ISNA(VLOOKUP($A138,'EKC2'!$P$4:$AB$48,12,FALSE)),\"\",VLOOKUP($A138,'EKC2'!$P$4:$AB$48,12,FALSE))","v":""},{"$f":"IF(ISNA(VLOOKUP($A138,'EKC3'!$P$4:$AB$48,12,FALSE)),\"\",VLOOKUP($A138,'EKC3'!$P$4:$AB$48,12,FALSE))","v":""},{"$f":"IF(ISNA(VLOOKUP($A138,'EKC4'!$P$4:$AB$48,12,FALSE)),\"\",VLOOKUP($A138,'EKC4'!$P$4:$AB$48,12,FALSE))","v":""},{"$f":"IF(ISNA(VLOOKUP($A138,'EKC5'!$P$4:$AB$48,12,FALSE)),\"\",VLOOKUP($A138,'EKC5'!$P$4:$AB$48,12,FALSE))","v":""},0,null,null,"",0]
[null,{"$f":"IF(ISNA(VLOOKUP($A139,'EKC1'!$P$4:$AB$48,12,FALSE)),\"\",VLOOKUP($A139,'EKC1'!$P$4:$AB$48,12,FALSE))","v":""},{"$f":"IF(ISNA(VLOOKUP($A139,'EKC2'!$P$4:$AB$48,12,FALSE)),\"\",VLOOKUP($A139,'EKC2'!$P$4:$AB$48,12,FALSE))","v":""},{"$f":"IF(ISNA(VLOOKUP($A139,'EKC3'!$P$4:$AB$48,12,FALSE)),\"\",VLOOKUP($A139,'EKC3'!$P$4:$AB$48,12,FALSE))","v":""},{"$f":"IF(ISNA(VLOOKUP($A139,'EKC4'!$P$4:$AB$48,12,FALSE)),\"\",VLOOKUP($A139,'EKC4'!$P$4:$AB$48,12,FALSE))","v":""},{"$f":"IF(ISNA(VLOOKUP($A139,'EKC5'!$P$4:$AB$48,12,FALSE)),\"\",VLOOKUP($A139,'EKC5'!$P$4:$AB$48,12,FALSE))","v":""},0,null,null,"",0]
[null,{"$f":"IF(ISNA(VLOOKUP($A140,'EKC1'!$P$4:$AB$48,12,FALSE)),\"\",VLOOKUP($A140,'EKC1'!$P$4:$AB$48,12,FALSE))","v":""},{"$f":"IF(ISNA(VLOOKUP($A140,'EKC2'!$P$4:$AB$48,12,FALSE)),\"\",VLOOKUP($A140,'EKC2'!$P$4:$AB$48,12,FALSE))","v":""},{"$f":"IF(ISNA(VLOOKUP($A140,'EKC3'!$P$4:$AB$48,12,FALSE)),\"\",VLOOKUP($A140,'EKC3'!$P$4:$AB$48,12,FALSE))","v":""},{"$f":"IF(ISNA(VLOOKUP($A140,'EKC4'!$P$4:$AB$48,12,FALSE)),\"\",VLOOKUP($A140,'EKC4'!$P$4:$AB$48,12,FALSE))","v":""},{"$f":"IF(ISNA(VLOOKUP($A140,'EKC5'!$P$4:$AB$48,12,FALSE)),\"\",VLOOKUP($A140,'EKC5'!$P$4:$AB$48,12,FALSE))","v":""},0,null,null,"",0]
[null,{"$f":"IF(ISNA(VLOOKUP($A141,'EKC1'!$P$4:$AB$48,12,FALSE)),\"\",VLOOKUP($A141,'EKC1'!$P$4:$AB$48,12,FALSE))","v":""},{"$f":"IF(ISNA(VLOOKUP($A141,'EKC2'!$P$4:$AB$48,12,FALSE)),\"\",VLOOKUP($A141,'EKC2'!$P$4:$AB$48,12,FALSE))","v":""},{"$f":"IF(ISNA(VLOOKUP($A141,'EKC3'!$P$4:$AB$48,12,FALSE)),\"\",VLOOKUP($A141,'EKC3'!$P$4:$AB$48,12,FALSE))","v":""},{"$f":"IF(ISNA(VLOOKUP($A141,'EKC4'!$P$4:$AB$48,12,FALSE)),\"\",VLOOKUP($A141,'EKC4'!$P$4:$AB$48,12,FALSE))","v":""},{"$f":"IF(ISNA(VLOOKUP($A141,'EKC5'!$P$4:$AB$48,12,FALSE)),\"\",VLOOKUP($A141,'EKC5'!$P$4:$AB$48,12,FALSE))","v":""},0,null,null,"",0]
[null,{"$f":"IF(ISNA(VLOOKUP($A142,'EKC1'!$P$4:$AB$48,12,FALSE)),\"\",VLOOKUP($A142,'EKC1'!$P$4:$AB$48,12,FALSE))","v":""},{"$f":"IF(ISNA(VLOOKUP($A142,'EKC2'!$P$4:$AB$48,12,FALSE)),\"\",VLOOKUP($A142,'EKC2'!$P$4:$AB$48,12,FALSE))","v":""},{"$f":"IF(ISNA(VLOOKUP($A142,'EKC3'!$P$4:$AB$48,12,FALSE)),\"\",VLOOKUP($A142,'EKC3'!$P$4:$AB$48,12,FALSE))","v":""},{"$f":"IF(ISNA(VLOOKUP($A142,'EKC4'!$P$4:$AB$48,12,FALSE)),\"\",VLOOKUP($A142,'EKC4'!$P$4:$AB$48,12,FALSE))","v":""},{"$f":"IF(ISNA(VLOOKUP($A142,'EKC5'!$P$4:$AB$48,12,FALSE)),\"\",VLOOKUP($A142,'EKC5'!$P$4:$AB$48,12,FALSE))","v":""},0,null,null,"",0]
[null,{"$f":"IF(ISNA(VLOOKUP($A143,'EKC1'!$P$4:$AB$48,12,FALSE)),\"\",VLOOKUP($A143,'EKC1'!$P$4:$AB$48,12,FALSE))","v":""},{"$f":"IF(ISNA(VLOOKUP($A143,'EKC2'!$P$4:$AB$48,12,FALSE)),\"\",VLOOKUP($A143,'EKC2'!$P$4:$AB$48,12,FALSE))","v":""},{"$f":"IF(ISNA(VLOOKUP($A143,'EKC3'!$P$4:$AB$48,12,FALSE)),\"\",VLOOKUP($A143,'EKC3'!$P$4:$AB$48,12,FALSE))","v":""},{"$f":"IF(ISNA(VLOOKUP($A143,'EKC4'!$P$4:$AB$48,12,FALSE)),\"\",VLOOKUP($A143,'EKC4'!$P$4:$AB$48,12,FALSE))","v":""},{"$f":"IF(ISNA(VLOOKUP($A143,'EKC5'!$P$4:$AB$48,12,FALSE)),\"\",VLOOKUP($A143,'EKC5'!$P$4:$AB$48,12,FALSE))","v":""},0,null,null,"",0]
[null,{"$f":"IF(ISNA(VLOOKUP($A144,'EKC1'!$P$4:$AB$48,12,FALSE)),\"\",VLOOKUP($A144,'EKC1'!$P$4:$AB$48,12,FALSE))","v":""},{"$f":"IF(ISNA(VLOOKUP($A144,'EKC2'!$P$4:$AB$48,12,FALSE)),\"\",VLOOKUP($A144,'EKC2'!$P$4:$AB$48,12,FALSE))","v":""},{"$f":"IF(ISNA(VLOOKUP($A144,'EKC3'!$P$4:$AB$48,12,FALSE)),\"\",VLOOKUP($A144,'EKC3'!$P$4:$AB$48,12,FALSE))","v":""},{"$f":"IF(ISNA(VLOOKUP($A144,'EKC4'!$P$4:$AB$48,12,FALSE)),\"\",VLOOKUP($A144,'EKC4'!$P$4:$AB$48,12,FALSE))","v":""},{"$f":"IF(ISNA(VLOOKUP($A144,'EKC5'!$P$4:$AB$48,12,FALSE)),\"\",VLOOKUP($A144,'EKC5'!$P$4:$AB$48,12,FALSE))","v":""},0,null,null,"",0]
[null,{"$f":"IF(ISNA(VLOOKUP($A145,'EKC1'!$P$4:$AB$48,12,FALSE)),\"\",VLOOKUP($A145,'EKC1'!$P$4:$AB$48,12,FALSE))","v":""},{"$f":"IF(ISNA(VLOOKUP($A145,'EKC2'!$P$4:$AB$48,12,FALSE)),\"\",VLOOKUP($A145,'EKC2'!$P$4:$AB$48,12,FALSE))","v":""},{"$f":"IF(ISNA(VLOOKUP($A145,'EKC3'!$P$4:$AB$48,12,FALSE)),\"\",VLOOKUP($A145,'EKC3'!$P$4:$AB$48,12,FALSE))","v":""},{"$f":"IF(ISNA(VLOOKUP($A145,'EKC4'!$P$4:$AB$48,12,FALSE)),\"\",VLOOKUP($A145,'EKC4'!$P$4:$AB$48,12,FALSE))","v":""},{"$f":"IF(ISNA(VLOOKUP($A145,'EKC5'!$P$4:$AB$48,12,FALSE)),\"\",VLOOKUP($A145,'EKC5'!$P$4:$AB$48,12,FALSE))","v":""},0,null,null,"",0]
[null,{"$f":"IF(ISNA(VLOOKUP($A146,'EKC1'!$P$4:$AB$48,12,FALSE)),\"\",VLOOKUP($A146,'EKC1'!$P$4:$AB$48,12,FALSE))","v":""},{"$f":"IF(ISNA(VLOOKUP($A146,'EKC2'!$P$4:$AB$48,12,FALSE)),\"\",VLOOKUP($A146,'EKC2'!$P$4:$AB$48,12,FALSE))","v":""},{"$f":"IF(ISNA(VLOOKUP($A146,'EKC3'!$P$4:$AB$48,12,FALSE)),\"\",VLOOKUP($A146,'EKC3'!$P$4:$AB$48,12,FALSE))","v":""},{"$f":"IF(ISNA(VLOOKUP($A146,'EKC4'!$P$4:$AB$48,12,FALSE)),\"\",VLOOKUP($A146,'EKC4'!$P$4:$AB$48,12,FALSE))","v":""},{"$f":"IF(ISNA(VLOOKUP($A146,'EKC5'!$P$4:$AB$48,12,FALSE)),\"\",VLOOKUP($A146,'EKC5'!$P$4:$AB$48,12,FALSE))","v":""},0,null,null,"",0]
[null,{"$f":"IF(ISNA(VLOOKUP($A147,'EKC1'!$P$4:$AB$48,12,FALSE)),\"\",VLOOKUP($A147,'EKC1'!$P$4:$AB$48,12,FALSE))","v":""},{"$f":"IF(ISNA(VLOOKUP($A147,'EKC2'!$P$4:$AB$48,12,FALSE)),\"\",VLOOKUP($A147,'EKC2'!$P$4:$AB$48,12,FALSE))","v":""},{"$f":"IF(ISNA(VLOOKUP($A147,'EKC3'!$P$4:$AB$48,12,FALSE)),\"\",VLOOKUP($A147,'EKC3'!$P$4:$AB$48,12,FALSE))","v":""},{"$f":"IF(ISNA(VLOOKUP($A147,'EKC4'!$P$4:$AB$48,12,FALSE)),\"\",VLOOKUP($A147,'EKC4'!$P$4:$AB$48,12,FALSE))","v":""},{"$f":"IF(ISNA(VLOOKUP($A147,'EKC5'!$P$4:$AB$48,12,FALSE)),\"\",VLOOKUP($A147,'EKC5'!$P$4:$AB$48,12,FALSE))","v":""},0,null,null,"",0]
[null,{"$f":"IF(ISNA(VLOOKUP($A148,'EKC1'!$P$4:$AB$48,12,FALSE)),\"\",VLOOKUP($A148,'EKC1'!$P$4:$AB$48,12,FALSE))","v":""},{"$f":"IF(ISNA(VLOOKUP($A148,'EKC2'!$P$4:$AB$48,12,FALSE)),\"\",VLOOKUP($A148,'EKC2'!$P$4:$AB$48,12,FALSE))","v":""},{"$f":"IF(ISNA(VLOOKUP($A148,'EKC3'!$P$4:$AB$48,12,FALSE)),\"\",VLOOKUP($A148,'EKC3'!$P$4:$AB$48,12,FALSE))","v":""},{"$f":"IF(ISNA(VLOOKUP($A148,'EKC4'!$P$4:$AB$48,12,FALSE)),\"\",VLOOKUP($A148,'EKC4'!$P$4:$AB$48,12,FALSE))","v":""},{"$f":"IF(ISNA(VLOOKUP($A148,'EKC5'!$P$4:$AB$48,12,FALSE)),\"\",VLOOKUP($A148,'EKC5'!$P$4:$AB$48,12,FALSE))","v":""},0,null,null,"",0]
[null,{"$f":"IF(ISNA(VLOOKUP($A149,'EKC1'!$P$4:$AB$48,12,FALSE)),\"\",VLOOKUP($A149,'EKC1'!$P$4:$AB$48,12,FALSE))","v":""},{"$f":"IF(ISNA(VLOOKUP($A149,'EKC2'!$P$4:$AB$48,12,FALSE)),\"\",VLOOKUP($A149,'EKC2'!$P$4:$AB$48,12,FALSE))","v":""},{"$f":"IF(ISNA(VLOOKUP($A149,'EKC3'!$P$4:$AB$48,12,FALSE)),\"\",VLOOKUP($A149,'EKC3'!$P$4:$AB$48,12,FALSE))","v":""},{"$f":"IF(ISNA(VLOOKUP($A149,'EKC4'!$P$4:$AB$48,12,FALSE)),\"\",VLOOKUP($A149,'EKC4'!$P$4:$AB$48,12,FALSE))","v":""},{"$f":"IF(ISNA(VLOOKUP($A149,'EKC5'!$P$4:$AB$48,12,FALSE)),\"\",VLOOKUP($A149,'EKC5'!$P$4:$AB$48,12,FALSE))","v":""},0,null,null,"",0]
[null,{"$f":"IF(ISNA(VLOOKUP($A150,'EKC1'!$P$4:$AB$48,12,FALSE)),\"\",VLOOKUP($A150,'EKC1'!$P$4:$AB$48,12,FALSE))","v":""},{"$f":"IF(ISNA(VLOOKUP($A150,'EKC2'!$P$4:$AB$48,12,FALSE)),\"\",VLOOKUP($A150,'EKC2'!$P$4:$AB$48,12,FALSE))","v":""},{"$f":"IF(ISNA(VLOOKUP($A150,'EKC3'!$P$4:$AB$48,12,FALSE)),\"\",VLOOKUP($A150,'EKC3'!$P$4:$AB$48,12,FALSE))","v":""},{"$f":"IF(ISNA(VLOOKUP($A150,'EKC4'!$P$4:$AB$48,12,FALSE)),\"\",VLOOKUP($A150,'EKC4'!$P$4:$AB$48,12,FALSE))","v":""},{"$f":"IF(ISNA(VLOOKUP($A150,'EKC5'!$P$4:$AB$48,12,FALSE)),\"\",VLOOKUP($A150,'EKC5'!$P$4:$AB$48,12,FALSE))","v":""},0,null,null,"",0]
[null,{"$f":"IF(ISNA(VLOOKUP($A151,'EKC1'!$P$4:$AB$48,12,FALSE)),\"\",VLOOKUP($A151,'EKC1'!$P$4:$AB$48,12,FALSE))","v":""},{"$f":"IF(ISNA(VLOOKUP($A151,'EKC2'!$P$4:$AB$48,12,FALSE)),\"\",VLOOKUP($A151,'EKC2'!$P$4:$AB$48,12,FALSE))","v":""},{"$f":"IF(ISNA(VLOOKUP($A151,'EKC3'!$P$4:$AB$48,12,FALSE)),\"\",VLOOKUP($A151,'EKC3'!$P$4:$AB$48,12,FALSE))","v":""},{"$f":"IF(ISNA(VLOOKUP($A151,'EKC4'!$P$4:$AB$48,12,FALSE)),\"\",VLOOKUP($A151,'EKC4'!$P$4:$AB$48,12,FALSE))","v":""},{"$f":"IF(ISNA(VLOOKUP($A151,'EKC5'!$P$4:$AB$48,12,FALSE)),\"\",VLOOKUP($A151,'EKC5'!$P$4:$AB$48,12,FALSE))","v":""},0,null,null,"",{"$f":"IF(ISBLANK(A152),0,1)","v":0}]
[null,{"$f":"IF(ISNA(VLOOKUP($A152,'EKC1'!$P$4:$AB$48,12,FALSE)),\"\",VLOOKUP($A152,'EKC1'!$P$4:$AB$48,12,FALSE))","v":""},{"$f":"IF(ISNA(VLOOKUP($A152,'EKC2'!$P$4:$AB$48,12,FALSE)),\"\",VLOOKUP($A152,'EKC2'!$P$4:$AB$48,12,FALSE))","v":""},{"$f":"IF(ISNA(VLOOKUP($A152,'EKC3'!$P$4:$AB$48,12,FALSE)),\"\",VLOOKUP($A152,'EKC3'!$P$4:$AB$48,12,FALSE))","v":""},{"$f":"IF(ISNA(VLOOKUP($A152,'EKC4'!$P$4:$AB$48,12,FALSE)),\"\",VLOOKUP($A152,'EKC4'!$P$4:$AB$48,12,FALSE))","v":""},{"$f":"IF(ISNA(VLOOKUP($A152,'EKC5'!$P$4:$AB$48,12,FALSE)),\"\",VLOOKUP($A152,'EKC5'!$P$4:$AB$48,12,FALSE))","v":""},0,null,null,"",0]
[null,{"$f":"IF(ISNA(VLOOKUP($A153,'EKC1'!$P$4:$AB$48,12,FALSE)),\"\",VLOOKUP($A153,'EKC1'!$P$4:$AB$48,12,FALSE))","v":""},{"$f":"IF(ISNA(VLOOKUP($A153,'EKC2'!$P$4:$AB$48,12,FALSE)),\"\",VLOOKUP($A153,'EKC2'!$P$4:$AB$48,12,FALSE))","v":""},{"$f":"IF(ISNA(VLOOKUP($A153,'EKC3'!$P$4:$AB$48,12,FALSE)),\"\",VLOOKUP($A153,'EKC3'!$P$4:$AB$48,12,FALSE))","v":""},{"$f":"IF(ISNA(VLOOKUP($A153,'EKC4'!$P$4:$AB$48,12,FALSE)),\"\",VLOOKUP($A153,'EKC4'!$P$4:$AB$48,12,FALSE))","v":""},{"$f":"IF(ISNA(VLOOKUP($A153,'EKC5'!$P$4:$AB$48,12,FALSE)),\"\",VLOOKUP($A153,'EKC5'!$P$4:$AB$48,12,FALSE))","v":""},0,null,null,"",0]
[null,{"$f":"IF(ISNA(VLOOKUP($A154,'EKC1'!$P$4:$AB$48,12,FALSE)),\"\",VLOOKUP($A154,'EKC1'!$P$4:$AB$48,12,FALSE))","v":""},{"$f":"IF(ISNA(VLOOKUP($A154,'EKC2'!$P$4:$AB$48,12,FALSE)),\"\",VLOOKUP($A154,'EKC2'!$P$4:$AB$48,12,FALSE))","v":""},{"$f":"IF(ISNA(VLOOKUP($A154,'EKC3'!$P$4:$AB$48,12,FALSE)),\"\",VLOOKUP($A154,'EKC3'!$P$4:$AB$48,12,FALSE))","v":""},{"$f":"IF(ISNA(VLOOKUP($A154,'EKC4'!$P$4:$AB$48,12,FALSE)),\"\",VLOOKUP($A154,'EKC4'!$P$4:$AB$48,12,FALSE))","v":""},{"$f":"IF(ISNA(VLOOKUP($A154,'EKC5'!$P$4:$AB$48,12,FALSE)),\"\",VLOOKUP($A154,'EKC5'!$P$4:$AB$48,12,FALSE))","v":""},0,null,null,"",0]
[null,{"$f":"IF(ISNA(VLOOKUP($A155,'EKC1'!$P$4:$AB$48,12,FALSE)),\"\",VLOOKUP($A155,'EKC1'!$P$4:$AB$48,12,FALSE))","v":""},{"$f":"IF(ISNA(VLOOKUP($A155,'EKC2'!$P$4:$AB$48,12,FALSE)),\"\",VLOOKUP($A155,'EKC2'!$P$4:$AB$48,12,FALSE))","v":""},{"$f":"IF(ISNA(VLOOKUP($A155,'EKC3'!$P$4:$AB$48,12,FALSE)),\"\",VLOOKUP($A155,'EKC3'!$P$4:$AB$48,12,FALSE))","v":""},{"$f":"IF(ISNA(VLOOKUP($A155,'EKC4'!$P$4:$AB$48,12,FALSE)),\"\",VLOOKUP($A155,'EKC4'!$P$4:$AB$48,12,FALSE))","v":""},{"$f":"IF(ISNA(VLOOKUP($A155,'EKC5'!$P$4:$AB$48,12,FALSE)),\"\",VLOOKUP($A155,'EKC5'!$P$4:$AB$48,12,FALSE))","v":""},0,null,null,"",0]
[null,{"$f":"IF(ISNA(VLOOKUP($A156,'EKC1'!$P$4:$AB$48,12,FALSE)),\"\",VLOOKUP($A156,'EKC1'!$P$4:$AB$48,12,FALSE))","v":""},{"$f":"IF(ISNA(VLOOKUP($A156,'EKC2'!$P$4:$AB$48,12,FALSE)),\"\",VLOOKUP($A156,'EKC2'!$P$4:$AB$48,12,FALSE))","v":""},{"$f":"IF(ISNA(VLOOKUP($A156,'EKC3'!$P$4:$AB$48,12,FALSE)),\"\",VLOOKUP($A156,'EKC3'!$P$4:$AB$48,12,FALSE))","v":""},{"$f":"IF(ISNA(VLOOKUP($A156,'EKC4'!$P$4:$AB$48,12,FALSE)),\"\",VLOOKUP($A156,'EKC4'!$P$4:$AB$48,12,FALSE))","v":""},{"$f":"IF(ISNA(VLOOKUP($A156,'EKC5'!$P$4:$AB$48,12,FALSE)),\"\",VLOOKUP($A156,'EKC5'!$P$4:$AB$48,12,FALSE))","v":""},0,null,null,"",0]
[null,{"$f":"IF(ISNA(VLOOKUP($A157,'EKC1'!$P$4:$AB$48,12,FALSE)),\"\",VLOOKUP($A157,'EKC1'!$P$4:$AB$48,12,FALSE))","v":""},{"$f":"IF(ISNA(VLOOKUP($A157,'EKC2'!$P$4:$AB$48,12,FALSE)),\"\",VLOOKUP($A157,'EKC2'!$P$4:$AB$48,12,FALSE))","v":""},{"$f":"IF(ISNA(VLOOKUP($A157,'EKC3'!$P$4:$AB$48,12,FALSE)),\"\",VLOOKUP($A157,'EKC3'!$P$4:$AB$48,12,FALSE))","v":""},{"$f":"IF(ISNA(VLOOKUP($A157,'EKC4'!$P$4:$AB$48,12,FALSE)),\"\",VLOOKUP($A157,'EKC4'!$P$4:$AB$48,12,FALSE))","v":""},{"$f":"IF(ISNA(VLOOKUP($A157,'EKC5'!$P$4:$AB$48,12,FALSE)),\"\",VLOOKUP($A157,'EKC5'!$P$4:$AB$48,12,FALSE))","v":""},0,null,null,"",0]
[null,{"$f":"IF(ISNA(VLOOKUP($A158,'EKC1'!$P$4:$AB$48,12,FALSE)),\"\",VLOOKUP($A158,'EKC1'!$P$4:$AB$48,12,FALSE))","v":""},{"$f":"IF(ISNA(VLOOKUP($A158,'EKC2'!$P$4:$AB$48,12,FALSE)),\"\",VLOOKUP($A158,'EKC2'!$P$4:$AB$48,12,FALSE))","v":""},{"$f":"IF(ISNA(VLOOKUP($A158,'EKC3'!$P$4:$AB$48,12,FALSE)),\"\",VLOOKUP($A158,'EKC3'!$P$4:$AB$48,12,FALSE))","v":""},{"$f":"IF(ISNA(VLOOKUP($A158,'EKC4'!$P$4:$AB$48,12,FALSE)),\"\",VLOOKUP($A158,'EKC4'!$P$4:$AB$48,12,FALSE))","v":""},{"$f":"IF(ISNA(VLOOKUP($A158,'EKC5'!$P$4:$AB$48,12,FALSE)),\"\",VLOOKUP($A158,'EKC5'!$P$4:$AB$48,12,FALSE))","v":""},0,null,null,"",0]
[null,{"$f":"IF(ISNA(VLOOKUP($A159,'EKC1'!$P$4:$AB$48,12,FALSE)),\"\",VLOOKUP($A159,'EKC1'!$P$4:$AB$48,12,FALSE))","v":""},{"$f":"IF(ISNA(VLOOKUP($A159,'EKC2'!$P$4:$AB$48,12,FALSE)),\"\",VLOOKUP($A159,'EKC2'!$P$4:$AB$48,12,FALSE))","v":""},{"$f":"IF(ISNA(VLOOKUP($A159,'EKC3'!$P$4:$AB$48,12,FALSE)),\"\",VLOOKUP($A159,'EKC3'!$P$4:$AB$48,12,FALSE))","v":""},{"$f":"IF(ISNA(VLOOKUP($A159,'EKC4'!$P$4:$AB$48,12,FALSE)),\"\",VLOOKUP($A159,'EKC4'!$P$4:$AB$48,12,FALSE))","v":""},{"$f":"IF(ISNA(VLOOKUP($A159,'EKC5'!$P$4:$AB$48,12,FALSE)),\"\",VLOOKUP($A159,'EKC5'!$P$4:$AB$48,12,FALSE))","v":""},0,null,null,"",0]
[null,{"$f":"IF(ISNA(VLOOKUP($A160,'EKC1'!$P$4:$AB$48,12,FALSE)),\"\",VLOOKUP($A160,'EKC1'!$P$4:$AB$48,12,FALSE))","v":""},{"$f":"IF(ISNA(VLOOKUP($A160,'EKC2'!$P$4:$AB$48,12,FALSE)),\"\",VLOOKUP($A160,'EKC2'!$P$4:$AB$48,12,FALSE))","v":""},{"$f":"IF(ISNA(VLOOKUP($A160,'EKC3'!$P$4:$AB$48,12,FALSE)),\"\",VLOOKUP($A160,'EKC3'!$P$4:$AB$48,12,FALSE))","v":""},{"$f":"IF(ISNA(VLOOKUP($A160,'EKC4'!$P$4:$AB$48,12,FALSE)),\"\",VLOOKUP($A160,'EKC4'!$P$4:$AB$48,12,FALSE))","v":""},{"$f":"IF(ISNA(VLOOKUP($A160,'EKC5'!$P$4:$AB$48,12,FALSE)),\"\",VLOOKUP($A160,'EKC5'!$P$4:$AB$48,12,FALSE))","v":""},0,null,null,"",0]
[null,{"$f":"IF(ISNA(VLOOKUP($A161,'EKC1'!$P$4:$AB$48,12,FALSE)),\"\",VLOOKUP($A161,'EKC1'!$P$4:$AB$48,12,FALSE))","v":""},{"$f":"IF(ISNA(VLOOKUP($A161,'EKC2'!$P$4:$AB$48,12,FALSE)),\"\",VLOOKUP($A161,'EKC2'!$P$4:$AB$48,12,FALSE))","v":""},{"$f":"IF(ISNA(VLOOKUP($A161,'EKC3'!$P$4:$AB$48,12,FALSE)),\"\",VLOOKUP($A161,'EKC3'!$P$4:$AB$48,12,FALSE))","v":""},{"$f":"IF(ISNA(VLOOKUP($A161,'EKC4'!$P$4:$AB$48,12,FALSE)),\"\",VLOOKUP($A161,'EKC4'!$P$4:$AB$48,12,FALSE))","v":""},{"$f":"IF(ISNA(VLOOKUP($A161,'EKC5'!$P$4:$AB$48,12,FALSE)),\"\",VLOOKUP($A161,'EKC5'!$P$4:$AB$48,12,FALSE))","v":""},0,null,null,"",0]
[null,{"$f":"IF(ISNA(VLOOKUP($A162,'EKC1'!$P$4:$AB$48,12,FALSE)),\"\",VLOOKUP($A162,'EKC1'!$P$4:$AB$48,12,FALSE))","v":""},{"$f":"IF(ISNA(VLOOKUP($A162,'EKC2'!$P$4:$AB$48,12,FALSE)),\"\",VLOOKUP($A162,'EKC2'!$P$4:$AB$48,12,FALSE))","v":""},{"$f":"IF(ISNA(VLOOKUP($A162,'EKC3'!$P$4:$AB$48,12,FALSE)),\"\",VLOOKUP($A162,'EKC3'!$P$4:$AB$48,12,FALSE))","v":""},{"$f":"IF(ISNA(VLOOKUP($A162,'EKC4'!$P$4:$AB$48,12,FALSE)),\"\",VLOOKUP($A162,'EKC4'!$P$4:$AB$48,12,FALSE))","v":""},{"$f":"IF(ISNA(VLOOKUP($A162,'EKC5'!$P$4:$AB$48,12,FALSE)),\"\",VLOOKUP($A162,'EKC5'!$P$4:$AB$48,12,FALSE))","v":""},0,null,null,"",0]
[null,{"$f":"IF(ISNA(VLOOKUP($A163,'EKC1'!$P$4:$AB$48,12,FALSE)),\"\",VLOOKUP($A163,'EKC1'!$P$4:$AB$48,12,FALSE))","v":""},{"$f":"IF(ISNA(VLOOKUP($A163,'EKC2'!$P$4:$AB$48,12,FALSE)),\"\",VLOOKUP($A163,'EKC2'!$P$4:$AB$48,12,FALSE))","v":""},{"$f":"IF(ISNA(VLOOKUP($A163,'EKC3'!$P$4:$AB$48,12,FALSE)),\"\",VLOOKUP($A163,'EKC3'!$P$4:$AB$48,12,FALSE))","v":""},{"$f":"IF(ISNA(VLOOKUP($A163,'EKC4'!$P$4:$AB$48,12,FALSE)),\"\",VLOOKUP($A163,'EKC4'!$P$4:$AB$48,12,FALSE))","v":""},{"$f":"IF(ISNA(VLOOKUP($A163,'EKC5'!$P$4:$AB$48,12,FALSE)),\"\",VLOOKUP($A163,'EKC5'!$P$4:$AB$48,12,FALSE))","v":""},0,null,null,"",0]
[null,{"$f":"IF(ISNA(VLOOKUP($A164,'EKC1'!$P$4:$AB$48,12,FALSE)),\"\",VLOOKUP($A164,'EKC1'!$P$4:$AB$48,12,FALSE))","v":""},{"$f":"IF(ISNA(VLOOKUP($A164,'EKC2'!$P$4:$AB$48,12,FALSE)),\"\",VLOOKUP($A164,'EKC2'!$P$4:$AB$48,12,FALSE))","v":""},{"$f":"IF(ISNA(VLOOKUP($A164,'EKC3'!$P$4:$AB$48,12,FALSE)),\"\",VLOOKUP($A164,'EKC3'!$P$4:$AB$48,12,FALSE))","v":""},{"$f":"IF(ISNA(VLOOKUP($A164,'EKC4'!$P$4:$AB$48,12,FALSE)),\"\",VLOOKUP($A164,'EKC4'!$P$4:$AB$48,12,FALSE))","v":""},{"$f":"IF(ISNA(VLOOKUP($A164,'EKC5'!$P$4:$AB$48,12,FALSE)),\"\",VLOOKUP($A164,'EKC5'!$P$4:$AB$48,12,FALSE))","v":""},0,null,null,"",0]
[null,{"$f":"IF(ISNA(VLOOKUP($A165,'EKC1'!$P$4:$AB$48,12,FALSE)),\"\",VLOOKUP($A165,'EKC1'!$P$4:$AB$48,12,FALSE))","v":""},{"$f":"IF(ISNA(VLOOKUP($A165,'EKC2'!$P$4:$AB$48,12,FALSE)),\"\",VLOOKUP($A165,'EKC2'!$P$4:$AB$48,12,FALSE))","v":""},{"$f":"IF(ISNA(VLOOKUP($A165,'EKC3'!$P$4:$AB$48,12,FALSE)),\"\",VLOOKUP($A165,'EKC3'!$P$4:$AB$48,12,FALSE))","v":""},{"$f":"IF(ISNA(VLOOKUP($A165,'EKC4'!$P$4:$AB$48,12,FALSE)),\"\",VLOOKUP($A165,'EKC4'!$P$4:$AB$48,12,FALSE))","v":""},{"$f":"IF(ISNA(VLOOKUP($A165,'EKC5'!$P$4:$AB$48,12,FALSE)),\"\",VLOOKUP($A165,'EKC5'!$P$4:$AB$48,12,FALSE))","v":""},0,null,null,"",0]
[null,{"$f":"IF(ISNA(VLOOKUP($A166,'EKC1'!$P$4:$AB$48,12,FALSE)),\"\",VLOOKUP($A166,'EKC1'!$P$4:$AB$48,12,FALSE))","v":""},{"$f":"IF(ISNA(VLOOKUP($A166,'EKC2'!$P$4:$AB$48,12,FALSE)),\"\",VLOOKUP($A166,'EKC2'!$P$4:$AB$48,12,FALSE))","v":""},{"$f":"IF(ISNA(VLOOKUP($A166,'EKC3'!$P$4:$AB$48,12,FALSE)),\"\",VLOOKUP($A166,'EKC3'!$P$4:$AB$48,12,FALSE))","v":""},{"$f":"IF(ISNA(VLOOKUP($A166,'EKC4'!$P$4:$AB$48,12,FALSE)),\"\",VLOOKUP($A166,'EKC4'!$P$4:$AB$48,12,FALSE))","v":""},{"$f":"IF(ISNA(VLOOKUP($A166,'EKC5'!$P$4:$AB$48,12,FALSE)),\"\",VLOOKUP($A166,'EKC5'!$P$4:$AB$48,12,FALSE))","v":""},0,null,null,"",0]
[null,{"$f":"IF(ISNA(VLOOKUP($A167,'EKC1'!$P$4:$AB$48,12,FALSE)),\"\",VLOOKUP($A167,'EKC1'!$P$4:$AB$48,12,FALSE))","v":""},{"$f":"IF(ISNA(VLOOKUP($A167,'EKC2'!$P$4:$AB$48,12,FALSE)),\"\",VLOOKUP($A167,'EKC2'!$P$4:$AB$48,12,FALSE))","v":""},{"$f":"IF(ISNA(VLOOKUP($A167,'EKC3'!$P$4:$AB$48,12,FALSE)),\"\",VLOOKUP($A167,'EKC3'!$P$4:$AB$48,12,FALSE))","v":""},{"$f":"IF(ISNA(VLOOKUP($A167,'EKC4'!$P$4:$AB$48,12,FALSE)),\"\",VLOOKUP($A167,'EKC4'!$P$4:$AB$48,12,FALSE))","v":""},{"$f":"IF(ISNA(VLOOKUP($A167,'EKC5'!$P$4:$AB$48,12,FALSE)),\"\",VLOOKUP($A167,'EKC5'!$P$4:$AB$48,12,FALSE))","v":""},0,null,null,"",0]
[null,{"$f":"IF(ISNA(VLOOKUP($A168,'EKC1'!$P$4:$AB$48,12,FALSE)),\"\",VLOOKUP($A168,'EKC1'!$P$4:$AB$48,12,FALSE))","v":""},{"$f":"IF(ISNA(VLOOKUP($A168,'EKC2'!$P$4:$AB$48,12,FALSE)),\"\",VLOOKUP($A168,'EKC2'!$P$4:$AB$48,12,FALSE))","v":""},{"$f":"IF(ISNA(VLOOKUP($A168,'EKC3'!$P$4:$AB$48,12,FALSE)),\"\",VLOOKUP($A168,'EKC3'!$P$4:$AB$48,12,FALSE))","v":""},{"$f":"IF(ISNA(VLOOKUP($A168,'EKC4'!$P$4:$AB$48,12,FALSE)),\"\",VLOOKUP($A168,'EKC4'!$P$4:$AB$48,12,FALSE))","v":""},{"$f":"IF(ISNA(VLOOKUP($A168,'EKC5'!$P$4:$AB$48,12,FALSE)),\"\",VLOOKUP($A168,'EKC5'!$P$4:$AB$48,12,FALSE))","v":""},0,null,null,"",0]
[null,{"$f":"IF(ISNA(VLOOKUP($A169,'EKC1'!$P$4:$AB$48,12,FALSE)),\"\",VLOOKUP($A169,'EKC1'!$P$4:$AB$48,12,FALSE))","v":""},{"$f":"IF(ISNA(VLOOKUP($A169,'EKC2'!$P$4:$AB$48,12,FALSE)),\"\",VLOOKUP($A169,'EKC2'!$P$4:$AB$48,12,FALSE))","v":""},{"$f":"IF(ISNA(VLOOKUP($A169,'EKC3'!$P$4:$AB$48,12,FALSE)),\"\",VLOOKUP($A169,'EKC3'!$P$4:$AB$48,12,FALSE))","v":""},{"$f":"IF(ISNA(VLOOKUP($A169,'EKC4'!$P$4:$AB$48,12,FALSE)),\"\",VLOOKUP($A169,'EKC4'!$P$4:$AB$48,12,FALSE))","v":""},{"$f":"IF(ISNA(VLOOKUP($A169,'EKC5'!$P$4:$AB$48,12,FALSE)),\"\",VLOOKUP($A169,'EKC5'!$P$4:$AB$48,12,FALSE))","v":""},0,null,null,"",0]
[null,{"$f":"IF(ISNA(VLOOKUP($A170,'EKC1'!$P$4:$AB$48,12,FALSE)),\"\",VLOOKUP($A170,'EKC1'!$P$4:$AB$48,12,FALSE))","v":""},{"$f":"IF(ISNA(VLOOKUP($A170,'EKC2'!$P$4:$AB$48,12,FALSE)),\"\",VLOOKUP($A170,'EKC2'!$P$4:$AB$48,12,FALSE))","v":""},{"$f":"IF(ISNA(VLOOKUP($A170,'EKC3'!$P$4:$AB$48,12,FALSE)),\"\",VLOOKUP($A170,'EKC3'!$P$4:$AB$48,12,FALSE))","v":""},{"$f":"IF(ISNA(VLOOKUP($A170,'EKC4'!$P$4:$AB$48,12,FALSE)),\"\",VLOOKUP($A170,'EKC4'!$P$4:$AB$48,12,FALSE))","v":""},{"$f":"IF(ISNA(VLOOKUP($A170,'EKC5'!$P$4:$AB$48,12,FALSE)),\"\",VLOOKUP($A170,'EKC5'!$P$4:$AB$48,12,FALSE))","v":""},0,null,null,"",0]
[null,{"$f":"IF(ISNA(VLOOKUP($A171,'EKC1'!$P$4:$AB$48,12,FALSE)),\"\",VLOOKUP($A171,'EKC1'!$P$4:$AB$48,12,FALSE))","v":""},{"$f":"IF(ISNA(VLOOKUP($A171,'EKC2'!$P$4:$AB$48,12,FALSE)),\"\",VLOOKUP($A171,'EKC2'!$P$4:$AB$48,12,FALSE))","v":""},{"$f":"IF(ISNA(VLOOKUP($A171,'EKC3'!$P$4:$AB$48,12,FALSE)),\"\",VLOOKUP($A171,'EKC3'!$P$4:$AB$48,12,FALSE))","v":""},{"$f":"IF(ISNA(VLOOKUP($A171,'EKC4'!$P$4:$AB$48,12,FALSE)),\"\",VLOOKUP($A171,'EKC4'!$P$4:$AB$48,12,FALSE))","v":""},{"$f":"IF(ISNA(VLOOKUP($A171,'EKC5'!$P$4:$AB$48,12,FALSE)),\"\",VLOOKUP($A171,'EKC5'!$P$4:$AB$48,12,FALSE))","v":""},0,null,null,"",0]
[null,{"$f":"IF(ISNA(VLOOKUP($A172,'EKC1'!$P$4:$AB$48,12,FALSE)),\"\",VLOOKUP($A172,'EKC1'!$P$4:$AB$48,12,FALSE))","v":""},{"$f":"IF(ISNA(VLOOKUP($A172,'EKC2'!$P$4:$AB$48,12,FALSE)),\"\",VLOOKUP($A172,'EKC2'!$P$4:$AB$48,12,FALSE))","v":""},{"$f":"IF(ISNA(VLOOKUP($A172,'EKC3'!$P$4:$AB$48,12,FALSE)),\"\",VLOOKUP($A172,'EKC3'!$P$4:$AB$48,12,FALSE))","v":""},{"$f":"IF(ISNA(VLOOKUP($A172,'EKC4'!$P$4:$AB$48,12,FALSE)),\"\",VLOOKUP($A172,'EKC4'!$P$4:$AB$48,12,FALSE))","v":""},{"$f":"IF(ISNA(VLOOKUP($A172,'EKC5'!$P$4:$AB$48,12,FALSE)),\"\",VLOOKUP($A172,'EKC5'!$P$4:$AB$48,12,FALSE))","v":""},0,null,null,"",0]
[null,{"$f":"IF(ISNA(VLOOKUP($A173,'EKC1'!$P$4:$AB$48,12,FALSE)),\"\",VLOOKUP($A173,'EKC1'!$P$4:$AB$48,12,FALSE))","v":""},{"$f":"IF(ISNA(VLOOKUP($A173,'EKC2'!$P$4:$AB$48,12,FALSE)),\"\",VLOOKUP($A173,'EKC2'!$P$4:$AB$48,12,FALSE))","v":""},{"$f":"IF(ISNA(VLOOKUP($A173,'EKC3'!$P$4:$AB$48,12,FALSE)),\"\",VLOOKUP($A173,'EKC3'!$P$4:$AB$48,12,FALSE))","v":""},{"$f":"IF(ISNA(VLOOKUP($A173,'EKC4'!$P$4:$AB$48,12,FALSE)),\"\",VLOOKUP($A173,'EKC4'!$P$4:$AB$48,12,FALSE))","v":""},{"$f":"IF(ISNA(VLOOKUP($A173,'EKC5'!$P$4:$AB$48,12,FALSE)),\"\",VLOOKUP($A173,'EKC5'!$P$4:$AB$48,12,FALSE))","v":""},0,null,null,"",0]
[null,{"$f":"IF(ISNA(VLOOKUP($A174,'EKC1'!$P$4:$AB$48,12,FALSE)),\"\",VLOOKUP($A174,'EKC1'!$P$4:$AB$48,12,FALSE))","v":""},{"$f":"IF(ISNA(VLOOKUP($A174,'EKC2'!$P$4:$AB$48,12,FALSE)),\"\",VLOOKUP($A174,'EKC2'!$P$4:$AB$48,12,FALSE))","v":""},{"$f":"IF(ISNA(VLOOKUP($A174,'EKC3'!$P$4:$AB$48,12,FALSE)),\"\",VLOOKUP($A174,'EKC3'!$P$4:$AB$48,12,FALSE))","v":""},{"$f":"IF(ISNA(VLOOKUP($A174,'EKC4'!$P$4:$AB$48,12,FALSE)),\"\",VLOOKUP($A174,'EKC4'!$P$4:$AB$48,12,FALSE))","v":""},{"$f":"IF(ISNA(VLOOKUP($A174,'EKC5'!$P$4:$AB$48,12,FALSE)),\"\",VLOOKUP($A174,'EKC5'!$P$4:$AB$48,12,FALSE))","v":""},0,null,null,"",0]
[null,{"$f":"IF(ISNA(VLOOKUP($A175,'EKC1'!$P$4:$AB$48,12,FALSE)),\"\",VLOOKUP($A175,'EKC1'!$P$4:$AB$48,12,FALSE))","v":""},{"$f":"IF(ISNA(VLOOKUP($A175,'EKC2'!$P$4:$AB$48,12,FALSE)),\"\",VLOOKUP($A175,'EKC2'!$P$4:$AB$48,12,FALSE))","v":""},{"$f":"IF(ISNA(VLOOKUP($A175,'EKC3'!$P$4:$AB$48,12,FALSE)),\"\",VLOOKUP($A175,'EKC3'!$P$4:$AB$48,12,FALSE))","v":""},{"$f":"IF(ISNA(VLOOKUP($A175,'EKC4'!$P$4:$AB$48,12,FALSE)),\"\",VLOOKUP($A175,'EKC4'!$P$4:$AB$48,12,FALSE))","v":""},{"$f":"IF(ISNA(VLOOKUP($A175,'EKC5'!$P$4:$AB$48,12,FALSE)),\"\",VLOOKUP($A175,'EKC5'!$P$4:$AB$48,12,FALSE))","v":""},0,null,null,"",0]
[null,{"$f":"IF(ISNA(VLOOKUP($A176,'EKC1'!$P$4:$AB$48,12,FALSE)),\"\",VLOOKUP($A176,'EKC1'!$P$4:$AB$48,12,FALSE))","v":""},{"$f":"IF(ISNA(VLOOKUP($A176,'EKC2'!$P$4:$AB$48,12,FALSE)),\"\",VLOOKUP($A176,'EKC2'!$P$4:$AB$48,12,FALSE))","v":""},{"$f":"IF(ISNA(VLOOKUP($A176,'EKC3'!$P$4:$AB$48,12,FALSE)),\"\",VLOOKUP($A176,'EKC3'!$P$4:$AB$48,12,FALSE))","v":""},{"$f":"IF(ISNA(VLOOKUP($A176,'EKC4'!$P$4:$AB$48,12,FALSE)),\"\",VLOOKUP($A176,'EKC4'!$P$4:$AB$48,12,FALSE))","v":""},{"$f":"IF(ISNA(VLOOKUP($A176,'EKC5'!$P$4:$AB$48,12,FALSE)),\"\",VLOOKUP($A176,'EKC5'!$P$4:$AB$48,12,FALSE))","v":""},0,null,null,"",0]
[null,{"$f":"IF(ISNA(VLOOKUP($A177,'EKC1'!$P$4:$AB$48,12,FALSE)),\"\",VLOOKUP($A177,'EKC1'!$P$4:$AB$48,12,FALSE))","v":""},{"$f":"IF(ISNA(VLOOKUP($A177,'EKC2'!$P$4:$AB$48,12,FALSE)),\"\",VLOOKUP($A177,'EKC2'!$P$4:$AB$48,12,FALSE))","v":""},{"$f":"IF(ISNA(VLOOKUP($A177,'EKC3'!$P$4:$AB$48,12,FALSE)),\"\",VLOOKUP($A177,'EKC3'!$P$4:$AB$48,12,FALSE))","v":""},{"$f":"IF(ISNA(VLOOKUP($A177,'EKC4'!$P$4:$AB$48,12,FALSE)),\"\",VLOOKUP($A177,'EKC4'!$P$4:$AB$48,12,FALSE))","v":""},{"$f":"IF(ISNA(VLOOKUP($A177,'EKC5'!$P$4:$AB$48,12,FALSE)),\"\",VLOOKUP($A177,'EKC5'!$P$4:$AB$48,12,FALSE))","v":""},0,null,null,"",0]
[null,{"$f":"IF(ISNA(VLOOKUP($A178,'EKC1'!$P$4:$AB$48,12,FALSE)),\"\",VLOOKUP($A178,'EKC1'!$P$4:$AB$48,12,FALSE))","v":""},{"$f":"IF(ISNA(VLOOKUP($A178,'EKC2'!$P$4:$AB$48,12,FALSE)),\"\",VLOOKUP($A178,'EKC2'!$P$4:$AB$48,12,FALSE))","v":""},{"$f":"IF(ISNA(VLOOKUP($A178,'EKC3'!$P$4:$AB$48,12,FALSE)),\"\",VLOOKUP($A178,'EKC3'!$P$4:$AB$48,12,FALSE))","v":""},{"$f":"IF(ISNA(VLOOKUP($A178,'EKC4'!$P$4:$AB$48,12,FALSE)),\"\",VLOOKUP($A178,'EKC4'!$P$4:$AB$48,12,FALSE))","v":""},{"$f":"IF(ISNA(VLOOKUP($A178,'EKC5'!$P$4:$AB$48,12,FALSE)),\"\",VLOOKUP($A178,'EKC5'!$P$4:$AB$48,12,FALSE))","v":""},0,null,null,"",0]
[null,{"$f":"IF(ISNA(VLOOKUP($A179,'EKC1'!$P$4:$AB$48,12,FALSE)),\"\",VLOOKUP($A179,'EKC1'!$P$4:$AB$48,12,FALSE))","v":""},{"$f":"IF(ISNA(VLOOKUP($A179,'EKC2'!$P$4:$AB$48,12,FALSE)),\"\",VLOOKUP($A179,'EKC2'!$P$4:$AB$48,12,FALSE))","v":""},{"$f":"IF(ISNA(VLOOKUP($A179,'EKC3'!$P$4:$AB$48,12,FALSE)),\"\",VLOOKUP($A179,'EKC3'!$P$4:$AB$48,12,FALSE))","v":""},{"$f":"IF(ISNA(VLOOKUP($A179,'EKC4'!$P$4:$AB$48,12,FALSE)),\"\",VLOOKUP($A179,'EKC4'!$P$4:$AB$48,12,FALSE))","v":""},{"$f":"IF(ISNA(VLOOKUP($A179,'EKC5'!$P$4:$AB$48,12,FALSE)),\"\",VLOOKUP($A179,'EKC5'!$P$4:$AB$48,12,FALSE))","v":""},0,null,null,"",0]
[null,{"$f":"IF(ISNA(VLOOKUP($A180,'EKC1'!$P$4:$AB$48,12,FALSE)),\"\",VLOOKUP($A180,'EKC1'!$P$4:$AB$48,12,FALSE))","v":""},{"$f":"IF(ISNA(VLOOKUP($A180,'EKC2'!$P$4:$AB$48,12,FALSE)),\"\",VLOOKUP($A180,'EKC2'!$P$4:$AB$48,12,FALSE))","v":""},{"$f":"IF(ISNA(VLOOKUP($A180,'EKC3'!$P$4:$AB$48,12,FALSE)),\"\",VLOOKUP($A180,'EKC3'!$P$4:$AB$48,12,FALSE))","v":""},{"$f":"IF(ISNA(VLOOKUP($A180,'EKC4'!$P$4:$AB$48,12,FALSE)),\"\",VLOOKUP($A180,'EKC4'!$P$4:$AB$48,12,FALSE))","v":""},{"$f":"IF(ISNA(VLOOKUP($A180,'EKC5'!$P$4:$AB$48,12,FALSE)),\"\",VLOOKUP($A180,'EKC5'!$P$4:$AB$48,12,FALSE))","v":""},0,null,null,"",0]
[null,{"$f":"IF(ISNA(VLOOKUP($A181,'EKC1'!$P$4:$AB$48,12,FALSE)),\"\",VLOOKUP($A181,'EKC1'!$P$4:$AB$48,12,FALSE))","v":""},{"$f":"IF(ISNA(VLOOKUP($A181,'EKC2'!$P$4:$AB$48,12,FALSE)),\"\",VLOOKUP($A181,'EKC2'!$P$4:$AB$48,12,FALSE))","v":""},{"$f":"IF(ISNA(VLOOKUP($A181,'EKC3'!$P$4:$AB$48,12,FALSE)),\"\",VLOOKUP($A181,'EKC3'!$P$4:$AB$48,12,FALSE))","v":""},{"$f":"IF(ISNA(VLOOKUP($A181,'EKC4'!$P$4:$AB$48,12,FALSE)),\"\",VLOOKUP($A181,'EKC4'!$P$4:$AB$48,12,FALSE))","v":""},{"$f":"IF(ISNA(VLOOKUP($A181,'EKC5'!$P$4:$AB$48,12,FALSE)),\"\",VLOOKUP($A181,'EKC5'!$P$4:$AB$48,12,FALSE))","v":""},0,null,null,"",0]
[null,{"$f":"IF(ISNA(VLOOKUP($A182,'EKC1'!$P$4:$AB$48,12,FALSE)),\"\",VLOOKUP($A182,'EKC1'!$P$4:$AB$48,12,FALSE))","v":""},{"$f":"IF(ISNA(VLOOKUP($A182,'EKC2'!$P$4:$AB$48,12,FALSE)),\"\",VLOOKUP($A182,'EKC2'!$P$4:$AB$48,12,FALSE))","v":""},{"$f":"IF(ISNA(VLOOKUP($A182,'EKC3'!$P$4:$AB$48,12,FALSE)),\"\",VLOOKUP($A182,'EKC3'!$P$4:$AB$48,12,FALSE))","v":""},{"$f":"IF(ISNA(VLOOKUP($A182,'EKC4'!$P$4:$AB$48,12,FALSE)),\"\",VLOOKUP($A182,'EKC4'!$P$4:$AB$48,12,FALSE))","v":""},{"$f":"IF(ISNA(VLOOKUP($A182,'EKC5'!$P$4:$AB$48,12,FALSE)),\"\",VLOOKUP($A182,'EKC5'!$P$4:$AB$48,12,FALSE))","v":""},0,null,null,"",0]
[null,{"$f":"IF(ISNA(VLOOKUP($A183,'EKC1'!$P$4:$AB$48,12,FALSE)),\"\",VLOOKUP($A183,'EKC1'!$P$4:$AB$48,12,FALSE))","v":""},{"$f":"IF(ISNA(VLOOKUP($A183,'EKC2'!$P$4:$AB$48,12,FALSE)),\"\",VLOOKUP($A183,'EKC2'!$P$4:$AB$48,12,FALSE))","v":""},{"$f":"IF(ISNA(VLOOKUP($A183,'EKC3'!$P$4:$AB$48,12,FALSE)),\"\",VLOOKUP($A183,'EKC3'!$P$4:$AB$48,12,FALSE))","v":""},{"$f":"IF(ISNA(VLOOKUP($A183,'EKC4'!$P$4:$AB$48,12,FALSE)),\"\",VLOOKUP($A183,'EKC4'!$P$4:$AB$48,12,FALSE))","v":""},{"$f":"IF(ISNA(VLOOKUP($A183,'EKC5'!$P$4:$AB$48,12,FALSE)),\"\",VLOOKUP($A183,'EKC5'!$P$4:$AB$48,12,FALSE))","v":""},0,null,null,"",0]
[null,{"$f":"IF(ISNA(VLOOKUP($A184,'EKC1'!$P$4:$AB$48,12,FALSE)),\"\",VLOOKUP($A184,'EKC1'!$P$4:$AB$48,12,FALSE))","v":""},{"$f":"IF(ISNA(VLOOKUP($A184,'EKC2'!$P$4:$AB$48,12,FALSE)),\"\",VLOOKUP($A184,'EKC2'!$P$4:$AB$48,12,FALSE))","v":""},{"$f":"IF(ISNA(VLOOKUP($A184,'EKC3'!$P$4:$AB$48,12,FALSE)),\"\",VLOOKUP($A184,'EKC3'!$P$4:$AB$48,12,FALSE))","v":""},{"$f":"IF(ISNA(VLOOKUP($A184,'EKC4'!$P$4:$AB$48,12,FALSE)),\"\",VLOOKUP($A184,'EKC4'!$P$4:$AB$48,12,FALSE))","v":""},{"$f":"IF(ISNA(VLOOKUP($A184,'EKC5'!$P$4:$AB$48,12,FALSE)),\"\",VLOOKUP($A184,'EKC5'!$P$4:$AB$48,12,FALSE))","v":""},0,null,null,"",0]
[null,{"$f":"IF(ISNA(VLOOKUP($A185,'EKC1'!$P$4:$AB$48,12,FALSE)),\"\",VLOOKUP($A185,'EKC1'!$P$4:$AB$48,12,FALSE))","v":""},{"$f":"IF(ISNA(VLOOKUP($A185,'EKC2'!$P$4:$AB$48,12,FALSE)),\"\",VLOOKUP($A185,'EKC2'!$P$4:$AB$48,12,FALSE))","v":""},{"$f":"IF(ISNA(VLOOKUP($A185,'EKC3'!$P$4:$AB$48,12,FALSE)),\"\",VLOOKUP($A185,'EKC3'!$P$4:$AB$48,12,FALSE))","v":""},{"$f":"IF(ISNA(VLOOKUP($A185,'EKC4'!$P$4:$AB$48,12,FALSE)),\"\",VLOOKUP($A185,'EKC4'!$P$4:$AB$48,12,FALSE))","v":""},{"$f":"IF(ISNA(VLOOKUP($A185,'EKC5'!$P$4:$AB$48,12,FALSE)),\"\",VLOOKUP($A185,'EKC5'!$P$4:$AB$48,12,FALSE))","v":""},0,null,null,"",0]
[null,{"$f":"IF(ISNA(VLOOKUP($A186,'EKC1'!$P$4:$AB$48,12,FALSE)),\"\",VLOOKUP($A186,'EKC1'!$P$4:$AB$48,12,FALSE))","v":""},{"$f":"IF(ISNA(VLOOKUP($A186,'EKC2'!$P$4:$AB$48,12,FALSE)),\"\",VLOOKUP($A186,'EKC2'!$P$4:$AB$48,12,FALSE))","v":""},{"$f":"IF(ISNA(VLOOKUP($A186,'EKC3'!$P$4:$AB$48,12,FALSE)),\"\",VLOOKUP($A186,'EKC3'!$P$4:$AB$48,12,FALSE))","v":""},{"$f":"IF(ISNA(VLOOKUP($A186,'EKC4'!$P$4:$AB$48,12,FALSE)),\"\",VLOOKUP($A186,'EKC4'!$P$4:$AB$48,12,FALSE))","v":""},{"$f":"IF(ISNA(VLOOKUP($A186,'EKC5'!$P$4:$AB$48,12,FALSE)),\"\",VLOOKUP($A186,'EKC5'!$P$4:$AB$48,12,FALSE))","v":""},0,null,null,"",0]
[null,{"$f":"IF(ISNA(VLOOKUP($A187,'EKC1'!$P$4:$AB$48,12,FALSE)),\"\",VLOOKUP($A187,'EKC1'!$P$4:$AB$48,12,FALSE))","v":""},{"$f":"IF(ISNA(VLOOKUP($A187,'EKC2'!$P$4:$AB$48,12,FALSE)),\"\",VLOOKUP($A187,'EKC2'!$P$4:$AB$48,12,FALSE))","v":""},{"$f":"IF(ISNA(VLOOKUP($A187,'EKC3'!$P$4:$AB$48,12,FALSE)),\"\",VLOOKUP($A187,'EKC3'!$P$4:$AB$48,12,FALSE))","v":""},{"$f":"IF(ISNA(VLOOKUP($A187,'EKC4'!$P$4:$AB$48,12,FALSE)),\"\",VLOOKUP($A187,'EKC4'!$P$4:$AB$48,12,FALSE))","v":""},{"$f":"IF(ISNA(VLOOKUP($A187,'EKC5'!$P$4:$AB$48,12,FALSE)),\"\",VLOOKUP($A187,'EKC5'!$P$4:$AB$48,12,FALSE))","v":""},0,null,null,"",0]
[null,{"$f":"IF(ISNA(VLOOKUP($A188,'EKC1'!$P$4:$AB$48,12,FALSE)),\"\",VLOOKUP($A188,'EKC1'!$P$4:$AB$48,12,FALSE))","v":""},{"$f":"IF(ISNA(VLOOKUP($A188,'EKC2'!$P$4:$AB$48,12,FALSE)),\"\",VLOOKUP($A188,'EKC2'!$P$4:$AB$48,12,FALSE))","v":""},{"$f":"IF(ISNA(VLOOKUP($A188,'EKC3'!$P$4:$AB$48,12,FALSE)),\"\",VLOOKUP($A188,'EKC3'!$P$4:$AB$48,12,FALSE))","v":""},{"$f":"IF(ISNA(VLOOKUP($A188,'EKC4'!$P$4:$AB$48,12,FALSE)),\"\",VLOOKUP($A188,'EKC4'!$P$4:$AB$48,12,FALSE))","v":""},{"$f":"IF(ISNA(VLOOKUP($A188,'EKC5'!$P$4:$AB$48,12,FALSE)),\"\",VLOOKUP($A188,'EKC5'!$P$4:$AB$48,12,FALSE))","v":""},0,null,null,"",0]
[null,{"$f":"IF(ISNA(VLOOKUP($A189,'EKC1'!$P$4:$AB$48,12,FALSE)),\"\",VLOOKUP($A189,'EKC1'!$P$4:$AB$48,12,FALSE))","v":""},{"$f":"IF(ISNA(VLOOKUP($A189,'EKC2'!$P$4:$AB$48,12,FALSE)),\"\",VLOOKUP($A189,'EKC2'!$P$4:$AB$48,12,FALSE))","v":""},{"$f":"IF(ISNA(VLOOKUP($A189,'EKC3'!$P$4:$AB$48,12,FALSE)),\"\",VLOOKUP($A189,'EKC3'!$P$4:$AB$48,12,FALSE))","v":""},{"$f":"IF(ISNA(VLOOKUP($A189,'EKC4'!$P$4:$AB$48,12,FALSE)),\"\",VLOOKUP($A189,'EKC4'!$P$4:$AB$48,12,FALSE))","v":""},{"$f":"IF(ISNA(VLOOKUP($A189,'EKC5'!$P$4:$AB$48,12,FALSE)),\"\",VLOOKUP($A189,'EKC5'!$P$4:$AB$48,12,FALSE))","v":""},0,null,null,"",0]
[null,{"$f":"IF(ISNA(VLOOKUP($A190,'EKC1'!$P$4:$AB$48,12,FALSE)),\"\",VLOOKUP($A190,'EKC1'!$P$4:$AB$48,12,FALSE))","v":""},{"$f":"IF(ISNA(VLOOKUP($A190,'EKC2'!$P$4:$AB$48,12,FALSE)),\"\",VLOOKUP($A190,'EKC2'!$P$4:$AB$48,12,FALSE))","v":""},{"$f":"IF(ISNA(VLOOKUP($A190,'EKC3'!$P$4:$AB$48,12,FALSE)),\"\",VLOOKUP($A190,'EKC3'!$P$4:$AB$48,12,FALSE))","v":""},{"$f":"IF(ISNA(VLOOKUP($A190,'EKC4'!$P$4:$AB$48,12,FALSE)),\"\",VLOOKUP($A190,'EKC4'!$P$4:$AB$48,12,FALSE))","v":""},{"$f":"IF(ISNA(VLOOKUP($A190,'EKC5'!$P$4:$AB$48,12,FALSE)),\"\",VLOOKUP($A190,'EKC5'!$P$4:$AB$48,12,FALSE))","v":""},0,null,null,"",0]
[null,{"$f":"IF(ISNA(VLOOKUP($A191,'EKC1'!$P$4:$AB$48,12,FALSE)),\"\",VLOOKUP($A191,'EKC1'!$P$4:$AB$48,12,FALSE))","v":""},{"$f":"IF(ISNA(VLOOKUP($A191,'EKC2'!$P$4:$AB$48,12,FALSE)),\"\",VLOOKUP($A191,'EKC2'!$P$4:$AB$48,12,FALSE))","v":""},{"$f":"IF(ISNA(VLOOKUP($A191,'EKC3'!$P$4:$AB$48,12,FALSE)),\"\",VLOOKUP($A191,'EKC3'!$P$4:$AB$48,12,FALSE))","v":""},{"$f":"IF(ISNA(VLOOKUP($A191,'EKC4'!$P$4:$AB$48,12,FALSE)),\"\",VLOOKUP($A191,'EKC4'!$P$4:$AB$48,12,FALSE))","v":""},{"$f":"IF(ISNA(VLOOKUP($A191,'EKC5'!$P$4:$AB$48,12,FALSE)),\"\",VLOOKUP($A191,'EKC5'!$P$4:$AB$48,12,FALSE))","v":""},0,null,null,"",0]
[null,{"$f":"IF(ISNA(VLOOKUP($A192,'EKC1'!$P$4:$AB$48,12,FALSE)),\"\",VLOOKUP($A192,'EKC1'!$P$4:$AB$48,12,FALSE))","v":""},{"$f":"IF(ISNA(VLOOKUP($A192,'EKC2'!$P$4:$AB$48,12,FALSE)),\"\",VLOOKUP($A192,'EKC2'!$P$4:$AB$48,12,FALSE))","v":""},{"$f":"IF(ISNA(VLOOKUP($A192,'EKC3'!$P$4:$AB$48,12,FALSE)),\"\",VLOOKUP($A192,'EKC3'!$P$4:$AB$48,12,FALSE))","v":""},{"$f":"IF(ISNA(VLOOKUP($A192,'EKC4'!$P$4:$AB$48,12,FALSE)),\"\",VLOOKUP($A192,'EKC4'!$P$4:$AB$48,12,FALSE))","v":""},{"$f":"IF(ISNA(VLOOKUP($A192,'EKC5'!$P$4:$AB$48,12,FALSE)),\"\",VLOOKUP($A192,'EKC5'!$P$4:$AB$48,12,FALSE))","v":""},0,null,null,"",0]
[null,{"$f":"IF(ISNA(VLOOKUP($A193,'EKC1'!$P$4:$AB$48,12,FALSE)),\"\",VLOOKUP($A193,'EKC1'!$P$4:$AB$48,12,FALSE))","v":""},{"$f":"IF(ISNA(VLOOKUP($A193,'EKC2'!$P$4:$AB$48,12,FALSE)),\"\",VLOOKUP($A193,'EKC2'!$P$4:$AB$48,12,FALSE))","v":""},{"$f":"IF(ISNA(VLOOKUP($A193,'EKC3'!$P$4:$AB$48,12,FALSE)),\"\",VLOOKUP($A193,'EKC3'!$P$4:$AB$48,12,FALSE))","v":""},{"$f":"IF(ISNA(VLOOKUP($A193,'EKC4'!$P$4:$AB$48,12,FALSE)),\"\",VLOOKUP($A193,'EKC4'!$P$4:$AB$48,12,FALSE))","v":""},{"$f":"IF(ISNA(VLOOKUP($A193,'EKC5'!$P$4:$AB$48,12,FALSE)),\"\",VLOOKUP($A193,'EKC5'!$P$4:$AB$48,12,FALSE))","v":""},0,null,null,"",0]
[null,{"$f":"IF(ISNA(VLOOKUP($A194,'EKC1'!$P$4:$AB$48,12,FALSE)),\"\",VLOOKUP($A194,'EKC1'!$P$4:$AB$48,12,FALSE))","v":""},{"$f":"IF(ISNA(VLOOKUP($A194,'EKC2'!$P$4:$AB$48,12,FALSE)),\"\",VLOOKUP($A194,'EKC2'!$P$4:$AB$48,12,FALSE))","v":""},{"$f":"IF(ISNA(VLOOKUP($A194,'EKC3'!$P$4:$AB$48,12,FALSE)),\"\",VLOOKUP($A194,'EKC3'!$P$4:$AB$48,12,FALSE))","v":""},{"$f":"IF(ISNA(VLOOKUP($A194,'EKC4'!$P$4:$AB$48,12,FALSE)),\"\",VLOOKUP($A194,'EKC4'!$P$4:$AB$48,12,FALSE))","v":""},{"$f":"IF(ISNA(VLOOKUP($A194,'EKC5'!$P$4:$AB$48,12,FALSE)),\"\",VLOOKUP($A194,'EKC5'!$P$4:$AB$48,12,FALSE))","v":""},0,null,null,"",0]
[null,{"$f":"IF(ISNA(VLOOKUP($A195,'EKC1'!$P$4:$AB$48,12,FALSE)),\"\",VLOOKUP($A195,'EKC1'!$P$4:$AB$48,12,FALSE))","v":""},{"$f":"IF(ISNA(VLOOKUP($A195,'EKC2'!$P$4:$AB$48,12,FALSE)),\"\",VLOOKUP($A195,'EKC2'!$P$4:$AB$48,12,FALSE))","v":""},{"$f":"IF(ISNA(VLOOKUP($A195,'EKC3'!$P$4:$AB$48,12,FALSE)),\"\",VLOOKUP($A195,'EKC3'!$P$4:$AB$48,12,FALSE))","v":""},{"$f":"IF(ISNA(VLOOKUP($A195,'EKC4'!$P$4:$AB$48,12,FALSE)),\"\",VLOOKUP($A195,'EKC4'!$P$4:$AB$48,12,FALSE))","v":""},{"$f":"IF(ISNA(VLOOKUP($A195,'EKC5'!$P$4:$AB$48,12,FALSE)),\"\",VLOOKUP($A195,'EKC5'!$P$4:$AB$48,12,FALSE))","v":""},0,null,null,"",0]
[null,{"$f":"IF(ISNA(VLOOKUP($A196,'EKC1'!$P$4:$AB$48,12,FALSE)),\"\",VLOOKUP($A196,'EKC1'!$P$4:$AB$48,12,FALSE))","v":""},{"$f":"IF(ISNA(VLOOKUP($A196,'EKC2'!$P$4:$AB$48,12,FALSE)),\"\",VLOOKUP($A196,'EKC2'!$P$4:$AB$48,12,FALSE))","v":""},{"$f":"IF(ISNA(VLOOKUP($A196,'EKC3'!$P$4:$AB$48,12,FALSE)),\"\",VLOOKUP($A196,'EKC3'!$P$4:$AB$48,12,FALSE))","v":""},{"$f":"IF(ISNA(VLOOKUP($A196,'EKC4'!$P$4:$AB$48,12,FALSE)),\"\",VLOOKUP($A196,'EKC4'!$P$4:$AB$48,12,FALSE))","v":""},{"$f":"IF(ISNA(VLOOKUP($A196,'EKC5'!$P$4:$AB$48,12,FALSE)),\"\",VLOOKUP($A196,'EKC5'!$P$4:$AB$48,12,FALSE))","v":""},{"$f":"IF(SUM(B196:F196)=0,0,SUM(B196:F196))","v":0},null,null,{"$f":"IF(ISBLANK(A196),\"\",IF(A197=A196,1,\"\"))","v":""},0]
[null,{"$f":"IF(ISNA(VLOOKUP($A197,'EKC1'!$P$4:$AB$48,12,FALSE)),\"\",VLOOKUP($A197,'EKC1'!$P$4:$AB$48,12,FALSE))","v":""},{"$f":"IF(ISNA(VLOOKUP($A197,'EKC2'!$P$4:$AB$48,12,FALSE)),\"\",VLOOKUP($A197,'EKC2'!$P$4:$AB$48,12,FALSE))","v":""},{"$f":"IF(ISNA(VLOOKUP($A197,'EKC3'!$P$4:$AB$48,12,FALSE)),\"\",VLOOKUP($A197,'EKC3'!$P$4:$AB$48,12,FALSE))","v":""},{"$f":"IF(ISNA(VLOOKUP($A197,'EKC4'!$P$4:$AB$48,12,FALSE)),\"\",VLOOKUP($A197,'EKC4'!$P$4:$AB$48,12,FALSE))","v":""},{"$f":"IF(ISNA(VLOOKUP($A197,'EKC5'!$P$4:$AB$48,12,FALSE)),\"\",VLOOKUP($A197,'EKC5'!$P$4:$AB$48,12,FALSE))","v":""},0,null,null,"",0]
[null,{"$f":"IF(ISNA(VLOOKUP($A198,'EKC1'!$P$4:$AB$48,12,FALSE)),\"\",VLOOKUP($A198,'EKC1'!$P$4:$AB$48,12,FALSE))","v":""},{"$f":"IF(ISNA(VLOOKUP($A198,'EKC2'!$P$4:$AB$48,12,FALSE)),\"\",VLOOKUP($A198,'EKC2'!$P$4:$AB$48,12,FALSE))","v":""},{"$f":"IF(ISNA(VLOOKUP($A198,'EKC3'!$P$4:$AB$48,12,FALSE)),\"\",VLOOKUP($A198,'EKC3'!$P$4:$AB$48,12,FALSE))","v":""},{"$f":"IF(ISNA(VLOOKUP($A198,'EKC4'!$P$4:$AB$48,12,FALSE)),\"\",VLOOKUP($A198,'EKC4'!$P$4:$AB$48,12,FALSE))","v":""},{"$f":"IF(ISNA(VLOOKUP($A198,'EKC5'!$P$4:$AB$48,12,FALSE)),\"\",VLOOKUP($A198,'EKC5'!$P$4:$AB$48,12,FALSE))","v":""},0,null,null,"",0]
[null,{"$f":"IF(ISNA(VLOOKUP($A199,'EKC1'!$P$4:$AB$48,12,FALSE)),\"\",VLOOKUP($A199,'EKC1'!$P$4:$AB$48,12,FALSE))","v":""},{"$f":"IF(ISNA(VLOOKUP($A199,'EKC2'!$P$4:$AB$48,12,FALSE)),\"\",VLOOKUP($A199,'EKC2'!$P$4:$AB$48,12,FALSE))","v":""},{"$f":"IF(ISNA(VLOOKUP($A199,'EKC3'!$P$4:$AB$48,12,FALSE)),\"\",VLOOKUP($A199,'EKC3'!$P$4:$AB$48,12,FALSE))","v":""},{"$f":"IF(ISNA(VLOOKUP($A199,'EKC4'!$P$4:$AB$48,12,FALSE)),\"\",VLOOKUP($A199,'EKC4'!$P$4:$AB$48,12,FALSE))","v":""},{"$f":"IF(ISNA(VLOOKUP($A199,'EKC5'!$P$4:$AB$48,12,FALSE)),\"\",VLOOKUP($A199,'EKC5'!$P$4:$AB$48,12,FALSE))","v":""},0,null,null,"",0]
[null,{"$f":"IF(ISNA(VLOOKUP($A200,'EKC1'!$P$4:$AB$48,12,FALSE)),\"\",VLOOKUP($A200,'EKC1'!$P$4:$AB$48,12,FALSE))","v":""},{"$f":"IF(ISNA(VLOOKUP($A200,'EKC2'!$P$4:$AB$48,12,FALSE)),\"\",VLOOKUP($A200,'EKC2'!$P$4:$AB$48,12,FALSE))","v":""},{"$f":"IF(ISNA(VLOOKUP($A200,'EKC3'!$P$4:$AB$48,12,FALSE)),\"\",VLOOKUP($A200,'EKC3'!$P$4:$AB$48,12,FALSE))","v":""},{"$f":"IF(ISNA(VLOOKUP($A200,'EKC4'!$P$4:$AB$48,12,FALSE)),\"\",VLOOKUP($A200,'EKC4'!$P$4:$AB$48,12,FALSE))","v":""},{"$f":"IF(ISNA(VLOOKUP($A200,'EKC5'!$P$4:$AB$48,12,FALSE)),\"\",VLOOKUP($A200,'EKC5'!$P$4:$AB$48,12,FALSE))","v":""},0,null,null,"",1]
["Fin"]

{"sheet":"EKC1","index":2,"n_rows":48,"n_cols":29,"rows_kept":48,"cut":false,"hidden":false,"merged":[[1,21,1,22],[1,23,1,25]]}
[null,"Course 1",null,null,null,null,null,null,"Course 2",null,null,null,null,null,null,"Classement Global"]
[null,null,null,null,null,null,null,null,null,null,null,null,null,null,null,null,null,null,null,null,null,"C1",null,"C2"]
["Classt","Equipe","Points","Pole","MT","Total",null,"Classt","Equipe","Points","Pole","MT","Total",null,"Classt","Equipe","M1","M2","Best","Calcul","Total","Pole","MT","Pole","MT","Points",null,{"$f":"SUM(AB4:AB48)","v":16}]
[1,"TEAM TIME PENALTY",35,null,1,{"$f":"C4+D4+E4","v":36},null,1,"JOKER TEAM",35,1,1,{"$f":"J4+K4+L4","v":37},null,1,"JOKER TEAM",{"$f":"IF(ISNA(VLOOKUP($P4,$B$4:$F$48,5,FALSE)),\"\",VLOOKUP($P4,$B$4:$F$48,5,FALSE))","v":32},{"$f":"IF(ISNA(VLOOKUP($P4,$I$4:$M$48,5,FALSE)),\"\",VLOOKUP($P4,$I$4:$M$48,5,FALSE))","v":37},null,{"$f":"IF(ISERROR(Q4+R4),0,(Q4+R4))+IF(ISBLANK(S4),0,AC4)","v":69},{"$f":"SUM(V4:Z4)","v":38},{"$f":"VLOOKUP($P4,$B$4:$E$48,3,FALSE)","v":1},{"$f":"VLOOKUP($P4,$B$4:$E$48,4,FALSE)","v":0},{"$f":"VLOOKUP($P4,$I$4:$L$48,3,FALSE)","v":1},{"$f":"VLOOKUP($P4,$I$4:$L$48,4,FALSE)","v":1},35,1,{"$f":"IF(P4=0,0,1)","v":1},{"$f":"IF(ISBLANK(S4),0,1-(S4/10))","v":0}]
[2,"ESSO SPORT",33,null,null,{"$f":"C5+D5+E5","v":33},null,2,"ESSO SPORT",33,null,null,{"$f":"J5+K5+L5","v":33},null,2,"ESSO SPORT",33,33,null,66,{"$f":"SUM(V5:Z5)","v":33},{"$f":"VLOOKUP($P5,$B$4:$E$48,3,FALSE)","v":0},{"$f":"VLOOKUP($P5,$B$4:$E$48,4,FALSE)","v":0},{"$f":"VLOOKUP($P5,$I$4:$L$48,3,FALSE)","v":0},{"$f":"VLOOKUP($P5,$I$4:$L$48,4,FALSE)","v":0},33,1,1,0]
[3,"JOKER TEAM",31,1,null,32,null,3,"MODAVE MRK PRO",31,null,null,31,null,3,"TEAM TIME PENALTY",36,29,null,65,32,0,1,0,0,31,1,1,0]
[4,"ALFA ROMEO RACING",30,null,null,30,null,4,"ERK TEAM",30,null,null,30,null,4,"MODAVE MRK PRO",29,31,null,60,30,0,0,0,0,30,1,1,0]
[5,"MODAVE MRK PRO",29,null,null,29,null,5,"TEAM TIME PENALTY",29,null,null,29,null,5,"ALFA ROMEO RACING",30,27,null,57,29,0,0,0,0,29,1,1,0]
[6,"FEEL EUROPE",28,null,null,28,null,6,"FEEL EUROPE",28,null,null,28,null,6,"ERK TEAM",26,30,1,56.9,28,0,0,0,0,28,1,1,0.9]
[7,"JM2 RACING",27,null,null,27,null,7,"ALFA ROMEO RACING",27,null,null,27,null,7,"FEEL EUROPE",28,28,null,56,{"$f":"SUM(V10:Z10)","v":27},0,0,0,0,27,1,1,{"$f":"IF(ISBLANK(S10),0,1-(S10/10))","v":0}]
[8,"ERK TEAM",26,null,null,26,null,8,"THALES 1",26,null,null,26,null,8,"JM2 RACING",27,24,1,51.9,26,0,0,0,0,26,1,{"$f":"IF(P11=0,0,1)","v":1},0.9]
[9,"THALES 1",25,null,null,25,null,9,"JDB TEAM",25,null,null,25,null,9,"THALES 1",25,26,null,51,25,0,0,0,0,25,1,1,0]
[10,"MECAGAZ",24,null,null,24,null,10,"JM2 RACING",24,null,null,24,null,10,"JDB TEAM",23,25,null,48,24,0,0,0,0,24,1,1,0]
[11,"JDB TEAM",23,null,null,23,null,11,"MECAGAZ",23,null,null,23,null,11,"MECAGAZ",24,23,null,47,23,0,0,0,0,23,1,1,0]
[12,"MACADAM RACING",22,null,null,22,null,12,"CAEN VERANDAS",22,null,null,22,null,12,"MACADAM RACING",22,21,null,43,22,0,0,0,0,22,1,1,0]
[13,"TEAM ENKART'ON",21,null,null,21,null,13,"MACADAM RACING",21,null,null,21,null,13,"CAEN VERANDAS",20,22,null,42,21,0,0,0,0,21,1,1,0]
[14,"CAEN VERANDAS",20,null,null,20,null,14,"TEAM ENKART'ON",20,null,null,20,null,14,"TEAM ENKART'ON",21,20,null,41,20,0,0,0,0,20,1,1,0]
[15,"TEAM RINHA",19,null,null,19,null,15,"TEAM RINHA",19,null,null,19,null,15,"TEAM RINHA",19,19,null,38,19,0,0,0,0,19,1,1,0]
[16,"TEAM CAIPI",18,null,null,18,null,16,"TEAM CAIPI",18,null,null,18,null,16,"TEAM CAIPI",18,18,null,36,18,0,0,0,0,18,1,1,0]
[17,"_ _",17,null,null,17,null,17,"_ _",17,null,null,17,null,17,null,"","",null,0,{"$error":"#N/A"},{"$error":"#N/A"},{"$error":"#N/A"},{"$error":"#N/A"},{"$error":"#N/A"},17,1,0,0]
[18,"_ _",16,null,null,16,null,18,"_ _",16,null,null,16,null,18,null,"","",null,0,{"$error":"#N/A"},{"$error":"#N/A"},{"$error":"#N/A"},{"$error":"#N/A"},{"$error":"#N/A"},16,1,0,0]
[19,"_ _",15,null,null,15,null,19,"_ _",15,null,null,15,null,19,null,"","",null,0,{"$error":"#N/A"},{"$error":"#N/A"},{"$error":"#N/A"},{"$error":"#N/A"},{"$error":"#N/A"},15,1,0,0]
[20,"_ _",14,null,null,14,null,20,"_ _",14,null,null,14,null,20,null,"","",null,0,{"$error":"#N/A"},{"$error":"#N/A"},{"$error":"#N/A"},{"$error":"#N/A"},{"$error":"#N/A"},14,1,0,0]
[21,"_ _",13,null,null,13,null,21,"_ _",13,null,null,13,null,21,null,"","",null,0,{"$error":"#N/A"},{"$error":"#N/A"},{"$error":"#N/A"},{"$error":"#N/A"},{"$error":"#N/A"},13,1,0,0]
[22,"_ _",12,null,null,12,null,22,"_ _",12,null,null,12,null,22,null,"","",null,0,{"$error":"#N/A"},{"$error":"#N/A"},{"$error":"#N/A"},{"$error":"#N/A"},{"$error":"#N/A"},12,1,0,0]
[23,"_ _",11,null,null,11,null,23,"_ _",11,null,null,11,null,23,null,"","",null,0,{"$error":"#N/A"},{"$error":"#N/A"},{"$error":"#N/A"},{"$error":"#N/A"},{"$error":"#N/A"},11,1,0,0]
[24,"_ _",10,null,null,10,null,24,"_ _",10,null,null,10,null,24,null,"","",null,0,{"$error":"#N/A"},{"$error":"#N/A"},{"$error":"#N/A"},{"$error":"#N/A"},{"$error":"#N/A"},10,1,0,0]
[25,"_ _",9,null,null,9,null,25,"_ _",9,null,null,9,null,25,null,"","",null,0,{"$error":"#N/A"},{"$error":"#N/A"},{"$error":"#N/A"},{"$error":"#N/A"},{"$error":"#N/A"},9,1,0,0]
[26,"_ _",8,null,null,8,null,26,"_ _",8,null,null,8,null,26,null,"","",null,0,{"$error":"#N/A"},{"$error":"#N/A"},{"$error":"#N/A"},{"$error":"#N/A"},{"$error":"#N/A"},8,1,0,0]
[27,"_ _",7,null,null,7,null,27,"_ _",7,null,null,7,null,27,null,"","",null,0,{"$error":"#N/A"},{"$error":"#N/A"},{"$error":"#N/A"},{"$error":"#N/A"},{"$error":"#N/A"},7,1,0,0]
[28,"_ _",6,null,null,6,null,28,"_ _",6,null,null,6,null,28,null,"","",null,0,{"$error":"#N/A"},{"$error":"#N/A"},{"$error":"#N/A"},{"$error":"#N/A"},{"$error":"#N/A"},6,1,0,0]
[29,"_ _",5,null,null,5,null,29,"_ _",5,null,null,5,null,29,null,"","",null,0,{"$error":"#N/A"},{"$error":"#N/A"},{"$error":"#N/A"},{"$error":"#N/A"},{"$error":"#N/A"},5,1,0,0]
[30,"_ _",4,null,null,4,null,30,"_ _",4,null,null,4,null,30,null,"","",null,0,{"$error":"#N/A"},{"$error":"#N/A"},{"$error":"#N/A"},{"$error":"#N/A"},{"$error":"#N/A"},4,1,0,0]
[31,"_ _",3,null,null,3,null,31,"_ _",3,null,null,3,null,31,null,"","",null,0,{"$error":"#N/A"},{"$error":"#N/A"},{"$error":"#N/A"},{"$error":"#N/A"},{"$error":"#N/A"},3,1,0,0]
[32,"_ _",2,null,null,2,null,32,"_ _",2,null,null,2,null,32,null,"","",null,0,{"$error":"#N/A"},{"$error":"#N/A"},{"$error":"#N/A"},{"$error":"#N/A"},{"$error":"#N/A"},2,1,0,0]
[33,"_ _",1,null,null,1,null,33,"_ _",1,null,null,1,null,33,null,"","",null,0,{"$error":"#N/A"},{"$error":"#N/A"},{"$error":"#N/A"},{"$error":"#N/A"},{"$error":"#N/A"},1,1,0,0]
[34,"_ _",1,null,null,1,null,34,"_ _",1,null,null,1,null,34,null,"","",null,0,{"$error":"#N/A"},{"$error":"#N/A"},{"$error":"#N/A"},{"$error":"#N/A"},{"$error":"#N/A"},1,1,0,0]
[35,"_ _",1,null,null,1,null,35,"_ _",1,null,null,1,null,35,null,"","",null,0,{"$error":"#N/A"},{"$error":"#N/A"},{"$error":"#N/A"},{"$error":"#N/A"},{"$error":"#N/A"},1,1,0,0]
[36,"_ _",1,null,null,1,null,36,"_ _",1,null,null,1,null,36,null,"","",null,0,{"$error":"#N/A"},{"$error":"#N/A"},{"$error":"#N/A"},{"$error":"#N/A"},{"$error":"#N/A"},1,1,0,0]
[37,"_ _",1,null,null,1,null,37,"_ _",1,null,null,1,null,37,null,"","",null,0,{"$error":"#N/A"},{"$error":"#N/A"},{"$error":"#N/A"},{"$error":"#N/A"},{"$error":"#N/A"},1,1,0,0]
[38,"_ _",1,null,null,1,null,38,"_ _",1,null,null,1,null,38,null,"","",null,0,{"$error":"#N/A"},{"$error":"#N/A"},{"$error":"#N/A"},{"$error":"#N/A"},{"$error":"#N/A"},1,1,0,0]
[39,"_ _",1,null,null,1,null,39,"_ _",1,null,null,1,null,39,null,"","",null,0,{"$error":"#N/A"},{"$error":"#N/A"},{"$error":"#N/A"},{"$error":"#N/A"},{"$error":"#N/A"},1,1,0,0]
[40,"_ _",1,null,null,1,null,40,"_ _",1,null,null,1,null,40,null,"","",null,0,{"$error":"#N/A"},{"$error":"#N/A"},{"$error":"#N/A"},{"$error":"#N/A"},{"$error":"#N/A"},1,1,0,0]
[41,"_ _",1,null,null,1,null,41,"_ _",1,null,null,1,null,41,null,"","",null,0,{"$error":"#N/A"},{"$error":"#N/A"},{"$error":"#N/A"},{"$error":"#N/A"},{"$error":"#N/A"},1,1,0,0]
[42,"_ _",1,null,null,1,null,42,"_ _",1,null,null,1,null,42,null,"","",null,0,{"$error":"#N/A"},{"$error":"#N/A"},{"$error":"#N/A"},{"$error":"#N/A"},{"$error":"#N/A"},1,1,0,0]
[43,"_ _",1,null,null,1,null,43,"_ _",1,null,null,1,null,43,null,"","",null,0,{"$error":"#N/A"},{"$error":"#N/A"},{"$error":"#N/A"},{"$error":"#N/A"},{"$error":"#N/A"},1,1,0,0]
[44,"_ _",1,null,null,1,null,44,"_ _",1,null,null,1,null,44,null,"","",null,0,{"$error":"#N/A"},{"$error":"#N/A"},{"$error":"#N/A"},{"$error":"#N/A"},{"$error":"#N/A"},1,1,0,0]
[45,"_ _",1,null,null,1,null,45,"_ _",1,null,null,1,null,45,null,"","",null,0,{"$error":"#N/A"},{"$error":"#N/A"},{"$error":"#N/A"},{"$error":"#N/A"},{"$error":"#N/A"},1,1,0,0]

{"sheet":"EKC2","index":3,"n_rows":48,"n_cols":29,"rows_kept":48,"cut":false,"hidden":false,"merged":[[1,21,1,22],[1,23,1,25]]}
[null,"Course 1",null,null,null,null,null,null,"Course 2",null,null,null,null,null,null,"Classement Global"]
[null,null,null,null,null,null,null,null,null,null,null,null,null,null,null,null,null,null,null,null,null,"C1",null,"C2"]
["Classt","Equipe","Points","Pole","MT","Total",null,"Classt","Equipe","Points","Pole","MT","Total",null,"Classt","Equipe","M1","M2","Best","Calcul","Total","Pole","MT","Pole","MT","Points",null,{"$f":"SUM(AB4:AB48)","v":0}]
[1,"_ _",35,null,null,{"$f":"C4+D4+E4","v":35},null,1,"_ _",35,null,null,{"$f":"J4+K4+L4","v":35},null,1,null,{"$f":"IF(ISNA(VLOOKUP($P4,$B$4:$F$48,5,FALSE)),\"\",VLOOKUP($P4,$B$4:$F$48,5,FALSE))","v":""},{"$f":"IF(ISNA(VLOOKUP($P4,$I$4:$M$48,5,FALSE)),\"\",VLOOKUP($P4,$I$4:$M$48,5,FALSE))","v":""},null,{"$f":"IF(ISERROR(Q4+R4),0,(Q4+R4))+IF(ISBLANK(S4),0,AC4)","v":0},{"$f":"SUM(V4:Z4)","v":{"$error":"#N/A"}},{"$f":"VLOOKUP($P4,$B$4:$E$48,3,FALSE)","v":{"$error":"#N/A"}},{"$f":"VLOOKUP($P4,$B$4:$E$48,4,FALSE)","v":{"$error":"#N/A"}},{"$f":"VLOOKUP($P4,$I$4:$L$48,3,FALSE)","v":{"$error":"#N/A"}},{"$f":"VLOOKUP($P4,$I$4:$L$48,4,FALSE)","v":{"$error":"#N/A"}},35,1,{"$f":"IF(P4=0,0,1)","v":0},{"$f":"IF(ISBLANK(S4),0,1-(S4/10))","v":0}]
[2,"_ _",33,null,null,{"$f":"C5+D5+E5","v":33},null,2,"_ _",33,null,null,{"$f":"J5+K5+L5","v":33},null,2,null,"","",null,0,{"$f":"SUM(V5:Z5)","v":{"$error":"#N/A"}},{"$f":"VLOOKUP($P5,$B$4:$E$48,3,FALSE)","v":{"$error":"#N/A"}},{"$f":"VLOOKUP($P5,$B$4:$E$48,4,FALSE)","v":{"$error":"#N/A"}},{"$f":"VLOOKUP($P5,$I$4:$L$48,3,FALSE)","v":{"$error":"#N/A"}},{"$f":"VLOOKUP($P5,$I$4:$L$48,4,FALSE)","v":{"$error":"#N/A"}},33,1,0,0]
[3,"_ _",31,null,null,31,null,3,"_ _",31,null,null,31,null,3,null,"","",null,0,{"$error":"#N/A"},{"$error":"#N/A"},{"$error":"#N/A"},{"$error":"#N/A"},{"$error":"#N/A"},31,1,0,0]
[4,"_ _",30,null,null,30,null,4,"_ _",30,null,null,30,null,4,null,"","",null,0,{"$error":"#N/A"},{"$error":"#N/A"},{"$error":"#N/A"},{"$error":"#N/A"},{"$error":"#N/A"},30,1,0,0]
[5,"_ _",29,null,null,29,null,5,"_ _",29,null,null,29,null,5,null,"","",null,0,{"$error":"#N/A"},{"$error":"#N/A"},{"$error":"#N/A"},{"$error":"#N/A"},{"$error":"#N/A"},29,1,0,0]
[6,"_ _",28,null,null,28,null,6,"_ _",28,null,null,28,null,6,null,"","",null,0,{"$error":"#N/A"},{"$error":"#N/A"},{"$error":"#N/A"},{"$error":"#N/A"},{"$error":"#N/A"},28,1,0,0]
[7,"_ _",27,null,null,27,null,7,"_ _",27,null,null,27,null,7,null,"","",null,0,{"$error":"#N/A"},{"$error":"#N/A"},{"$error":"#N/A"},{"$error":"#N/A"},{"$error":"#N/A"},27,1,0,{"$f":"IF(ISBLANK(S10),0,1-(S10/10))","v":0}]
[8,"_ _",26,null,null,26,null,8,"_ _",26,null,null,26,null,8,null,"","",null,0,{"$error":"#N/A"},{"$error":"#N/A"},{"$error":"#N/A"},{"$error":"#N/A"},{"$error":"#N/A"},26,1,{"$f":"IF(P11=0,0,1)","v":0},0]
[9,"_ _",25,null,null,25,null,9,"_ _",25,null,null,25,null,9,null,"","",null,0,{"$error":"#N/A"},{"$error":"#N/A"},{"$error":"#N/A"},{"$error":"#N/A"},{"$error":"#N/A"},25,1,0,0]
[10,"_ _",24,null,null,24,null,10,"_ _",24,null,null,24,null,10,null,"","",null,0,{"$error":"#N/A"},{"$error":"#N/A"},{"$error":"#N/A"},{"$error":"#N/A"},{"$error":"#N/A"},24,1,0,0]
[11,"_ _",23,null,null,23,null,11,"_ _",23,null,null,23,null,11,null,"","",null,0,{"$error":"#N/A"},{"$error":"#N/A"},{"$error":"#N/A"},{"$error":"#N/A"},{"$error":"#N/A"},23,1,0,0]
[12,"_ _",22,null,null,22,null,12,"_ _",22,null,null,22,null,12,null,"","",null,0,{"$error":"#N/A"},{"$error":"#N/A"},{"$error":"#N/A"},{"$error":"#N/A"},{"$error":"#N/A"},22,1,0,0]
[13,"_ _",21,null,null,21,null,13,"_ _",21,null,null,21,null,13,null,"","",null,0,{"$error":"#N/A"},{"$error":"#N/A"},{"$error":"#N/A"},{"$error":"#N/A"},{"$error":"#N/A"},21,1,0,0]
[14,"_ _",20,null,null,20,null,14,"_ _",20,null,null,20,null,14,null,"","",null,0,{"$error":"#N/A"},{"$error":"#N/A"},{"$error":"#N/A"},{"$error":"#N/A"},{"$error":"#N/A"},20,1,0,0]
[15,"_ _",19,null,null,19,null,15,"_ _",19,null,null,19,null,15,null,"","",null,0,{"$error":"#N/A"},{"$error":"#N/A"},{"$error":"#N/A"},{"$error":"#N/A"},{"$error":"#N/A"},19,1,0,0]
[16,"_ _",18,null,null,18,null,16,"_ _",18,null,null,18,null,16,null,"","",null,0,{"$error":"#N/A"},{"$error":"#N/A"},{"$error":"#N/A"},{"$error":"#N/A"},{"$error":"#N/A"},18,1,0,0]
[17,"_ _",17,null,null,17,null,17,"_ _",17,null,null,17,null,17,null,"","",null,0,{"$error":"#N/A"},{"$error":"#N/A"},{"$error":"#N/A"},{"$error":"#N/A"},{"$error":"#N/A"},17,1,0,0]
[18,"_ _",16,null,null,16,null,18,"_ _",16,null,null,16,null,18,null,"","",null,0,{"$error":"#N/A"},{"$error":"#N/A"},{"$error":"#N/A"},{"$error":"#N/A"},{"$error":"#N/A"},16,1,0,0]
[19,"_ _",15,null,null,15,null,19,"_ _",15,null,null,15,null,19,null,"","",null,0,{"$error":"#N/A"},{"$error":"#N/A"},{"$error":"#N/A"},{"$error":"#N/A"},{"$error":"#N/A"},15,1,0,0]
[20,"_ _",14,null,null,14,null,20,"_ _",14,null,null,14,null,20,null,"","",null,0,{"$error":"#N/A"},{"$error":"#N/A"},{"$error":"#N/A"},{"$error":"#N/A"},{"$error":"#N/A"},14,1,0,0]
[21,"_ _",13,null,null,13,null,21,"_ _",13,null,null,13,null,21,null,"","",null,0,{"$error":"#N/A"},{"$error":"#N/A"},{"$error":"#N/A"},{"$error":"#N/A"},{"$error":"#N/A"},13,1,0,0]
[22,"_ _",12,null,null,12,null,22,"_ _",12,null,null,12,null,22,null,"","",null,0,{"$error":"#N/A"},{"$error":"#N/A"},{"$error":"#N/A"},{"$error":"#N/A"},{"$error":"#N/A"},12,1,0,0]
[23,"_ _",11,null,null,11,null,23,"_ _",11,null,null,11,null,23,null,"","",null,0,{"$error":"#N/A"},{"$error":"#N/A"},{"$error":"#N/A"},{"$error":"#N/A"},{"$error":"#N/A"},11,1,0,0]
[24,"_ _",10,null,null,10,null,24,"_ _",10,null,null,10,null,24,null,"","",null,0,{"$error":"#N/A"},{"$error":"#N/A"},{"$error":"#N/A"},{"$error":"#N/A"},{"$error":"#N/A"},10,1,0,0]
[25,"_ _",9,null,null,9,null,25,"_ _",9,null,null,9,null,25,null,"","",null,0,{"$error":"#N/A"},{"$error":"#N/A"},{"$error":"#N/A"},{"$error":"#N/A"},{"$error":"#N/A"},9,1,0,0]
[26,"_ _",8,null,null,8,null,26,"_ _",8,null,null,8,null,26,null,"","",null,0,{"$error":"#N/A"},{"$error":"#N/A"},{"$error":"#N/A"},{"$error":"#N/A"},{"$error":"#N/A"},8,1,0,0]
[27,"_ _",7,null,null,7,null,27,"_ _",7,null,null,7,null,27,null,"","",null,0,{"$error":"#N/A"},{"$error":"#N/A"},{"$error":"#N/A"},{"$error":"#N/A"},{"$error":"#N/A"},7,1,0,0]
[28,"_ _",6,null,null,6,null,28,"_ _",6,null,null,6,null,28,null,"","",null,0,{"$error":"#N/A"},{"$error":"#N/A"},{"$error":"#N/A"},{"$error":"#N/A"},{"$error":"#N/A"},6,1,0,0]
[29,"_ _",5,null,null,5,null,29,"_ _",5,null,null,5,null,29,null,"","",null,0,{"$error":"#N/A"},{"$error":"#N/A"},{"$error":"#N/A"},{"$error":"#N/A"},{"$error":"#N/A"},5,1,0,0]
[30,"_ _",4,null,null,4,null,30,"_ _",4,null,null,4,null,30,null,"","",null,0,{"$error":"#N/A"},{"$error":"#N/A"},{"$error":"#N/A"},{"$error":"#N/A"},{"$error":"#N/A"},4,1,0,0]
[31,"_ _",3,null,null,3,null,31,"_ _",3,null,null,3,null,31,null,"","",null,0,{"$error":"#N/A"},{"$error":"#N/A"},{"$error":"#N/A"},{"$error":"#N/A"},{"$error":"#N/A"},3,1,0,0]
[32,"_ _",2,null,null,2,null,32,"_ _",2,null,null,2,null,32,null,"","",null,0,{"$error":"#N/A"},{"$error":"#N/A"},{"$error":"#N/A"},{"$error":"#N/A"},{"$error":"#N/A"},2,1,0,0]
[33,"_ _",1,null,null,1,null,33,"_ _",1,null,null,1,null,33,null,"","",null,0,{"$error":"#N/A"},{"$error":"#N/A"},{"$error":"#N/A"},{"$error":"#N/A"},{"$error":"#N/A"},1,1,0,0]
[34,"_ _",1,null,null,1,null,34,"_ _",1,null,null,1,null,34,null,"","",null,0,{"$error":"#N/A"},{"$error":"#N/A"},{"$error":"#N/A"},{"$error":"#N/A"},{"$error":"#N/A"},1,1,0,0]
[35,"_ _",1,null,null,1,null,35,"_ _",1,null,null,1,null,35,null,"","",null,0,{"$error":"#N/A"},{"$error":"#N/A"},{"$error":"#N/A"},{"$error":"#N/A"},{"$error":"#N/A"},1,1,0,0]
[36,"_ _",1,null,null,1,null,36,"_ _",1,null,null,1,null,36,null,"","",null,0,{"$error":"#N/A"},{"$error":"#N/A"},{"$error":"#N/A"},{"$error":"#N/A"},{"$error":"#N/A"},1,1,0,0]
[37,"_ _",1,null,null,1,null,37,"_ _",1,null,null,1,null,37,null,"","",null,0,{"$error":"#N/A"},{"$error":"#N/A"},{"$error":"#N/A"},{"$error":"#N/A"},{"$error":"#N/A"},1,1,0,0]
[38,"_ _",1,null,null,1,null,38,"_ _",1,null,null,1,null,38,null,"","",null,0,{"$error":"#N/A"},{"$error":"#N/A"},{"$error":"#N/A"},{"$error":"#N/A"},{"$error":"#N/A"},1,1,0,0]
[39,"_ _",1,null,null,1,null,39,"_ _",1,null,null,1,null,39,null,"","",null,0,{"$error":"#N/A"},{"$error":"#N/A"},{"$error":"#N/A"},{"$error":"#N/A"},{"$error":"#N/A"},1,1,0,0]
[40,"_ _",1,null,null,1,null,40,"_ _",1,null,null,1,null,40,null,"","",null,0,{"$error":"#N/A"},{"$error":"#N/A"},{"$error":"#N/A"},{"$error":"#N/A"},{"$error":"#N/A"},1,1,0,0]
[41,"_ _",1,null,null,1,null,41,"_ _",1,null,null,1,null,41,null,"","",null,0,{"$error":"#N/A"},{"$error":"#N/A"},{"$error":"#N/A"},{"$error":"#N/A"},{"$error":"#N/A"},1,1,0,0]
[42,"_ _",1,null,null,1,null,42,"_ _",1,null,null,1,null,42,null,"","",null,0,{"$error":"#N/A"},{"$error":"#N/A"},{"$error":"#N/A"},{"$error":"#N/A"},{"$error":"#N/A"},1,1,0,0]
[43,"_ _",1,null,null,1,null,43,"_ _",1,null,null,1,null,43,null,"","",null,0,{"$error":"#N/A"},{"$error":"#N/A"},{"$error":"#N/A"},{"$error":"#N/A"},{"$error":"#N/A"},1,1,0,0]
[44,"_ _",1,null,null,1,null,44,"_ _",1,null,null,1,null,44,null,"","",null,0,{"$error":"#N/A"},{"$error":"#N/A"},{"$error":"#N/A"},{"$error":"#N/A"},{"$error":"#N/A"},1,1,0,0]
[45,"_ _",1,null,null,1,null,45,"_ _",1,null,null,1,null,45,null,"","",null,0,{"$error":"#N/A"},{"$error":"#N/A"},{"$error":"#N/A"},{"$error":"#N/A"},{"$error":"#N/A"},1,1,0,0]

{"sheet":"EKC3","index":4,"n_rows":48,"n_cols":29,"rows_kept":48,"cut":false,"hidden":false,"merged":[[1,21,1,22],[1,23,1,25]]}
[null,"Course 1",null,null,null,null,null,null,"Course 2",null,null,null,null,null,null,"Classement Global"]
[null,null,null,null,null,null,null,null,null,null,null,null,null,null,null,null,null,null,null,null,null,"C1",null,"C2"]
["Classt","Equipe","Points","Pole","MT","Total",null,"Classt","Equipe","Points","Pole","MT","Total",null,"Classt","Equipe","M1","M2","Best","Calcul","Total","Pole","MT","Pole","MT","Points",null,{"$f":"SUM(AB4:AB48)","v":0}]
[1,"_ _",35,null,null,{"$f":"C4+D4+E4","v":35},null,1,"_ _",35,null,null,{"$f":"J4+K4+L4","v":35},null,1,null,{"$f":"IF(ISNA(VLOOKUP($P4,$B$4:$F$48,5,FALSE)),\"\",VLOOKUP($P4,$B$4:$F$48,5,FALSE))","v":""},{"$f":"IF(ISNA(VLOOKUP($P4,$I$4:$M$48,5,FALSE)),\"\",VLOOKUP($P4,$I$4:$M$48,5,FALSE))","v":""},null,{"$f":"IF(ISERROR(Q4+R4),0,(Q4+R4))+IF(ISBLANK(S4),0,AC4)","v":0},{"$f":"SUM(V4:Z4)","v":{"$error":"#N/A"}},{"$f":"VLOOKUP($P4,$B$4:$E$48,3,FALSE)","v":{"$error":"#N/A"}},{"$f":"VLOOKUP($P4,$B$4:$E$48,4,FALSE)","v":{"$error":"#N/A"}},{"$f":"VLOOKUP($P4,$I$4:$L$48,3,FALSE)","v":{"$error":"#N/A"}},{"$f":"VLOOKUP($P4,$I$4:$L$48,4,FALSE)","v":{"$error":"#N/A"}},35,1,{"$f":"IF(P4=0,0,1)","v":0},{"$f":"IF(ISBLANK(S4),0,1-(S4/10))","v":0}]
[2,"_ _",33,null,null,{"$f":"C5+D5+E5","v":33},null,2,"_ _",33,null,null,{"$f":"J5+K5+L5","v":33},null,2,null,"","",null,0,{"$f":"SUM(V5:Z5)","v":{"$error":"#N/A"}},{"$f":"VLOOKUP($P5,$B$4:$E$48,3,FALSE)","v":{"$error":"#N/A"}},{"$f":"VLOOKUP($P5,$B$4:$E$48,4,FALSE)","v":{"$error":"#N/A"}},{"$f":"VLOOKUP($P5,$I$4:$L$48,3,FALSE)","v":{"$error":"#N/A"}},{"$f":"VLOOKUP($P5,$I$4:$L$48,4,FALSE)","v":{"$error":"#N/A"}},33,1,0,0]
[3,"_ _",31,null,null,31,null,3,"_ _",31,null,null,31,null,3,null,"","",null,0,{"$error":"#N/A"},{"$error":"#N/A"},{"$error":"#N/A"},{"$error":"#N/A"},{"$error":"#N/A"},31,1,0,0]
[4,"_ _",30,null,null,30,null,4,"_ _",30,null,null,30,null,4,null,"","",null,0,{"$error":"#N/A"},{"$error":"#N/A"},{"$error":"#N/A"},{"$error":"#N/A"},{"$error":"#N/A"},30,1,0,0]
[5,"_ _",29,null,null,29,null,5,"_ _",29,null,null,29,null,5,null,"","",null,0,{"$error":"#N/A"},{"$error":"#N/A"},{"$error":"#N/A"},{"$error":"#N/A"},{"$error":"#N/A"},29,1,0,0]
[6,"_ _",28,null,null,28,null,6,"_ _",28,null,null,28,null,6,null,"","",null,0,{"$error":"#N/A"},{"$error":"#N/A"},{"$error":"#N/A"},{"$error":"#N/A"},{"$error":"#N/A"},28,1,0,0]
[7,"_ _",27,null,null,27,null,7,"_ _",27,null,null,27,null,7,null,"","",null,0,{"$error":"#N/A"},{"$error":"#N/A"},{"$error":"#N/A"},{"$error":"#N/A"},{"$error":"#N/A"},27,1,0,{"$f":"IF(ISBLANK(S10),0,1-(S10/10))","v":0}]
[8,"_ _",26,null,null,26,null,8,"_ _",26,null,null,26,null,8,null,"","",null,0,{"$error":"#N/A"},{"$error":"#N/A"},{"$error":"#N/A"},{"$error":"#N/A"},{"$error":"#N/A"},26,1,{"$f":"IF(P11=0,0,1)","v":0},0]
[9,"_ _",25,null,null,25,null,9,"_ _",25,null,null,25,null,9,null,"","",null,0,{"$error":"#N/A"},{"$error":"#N/A"},{"$error":"#N/A"},{"$error":"#N/A"},{"$error":"#N/A"},25,1,0,0]
[10,"_ _",24,null,null,24,null,10,"_ _",24,null,null,24,null,10,null,"","",null,0,{"$error":"#N/A"},{"$error":"#N/A"},{"$error":"#N/A"},{"$error":"#N/A"},{"$error":"#N/A"},24,1,0,0]
[11,"_ _",23,null,null,23,null,11,"_ _",23,null,null,23,null,11,null,"","",null,0,{"$error":"#N/A"},{"$error":"#N/A"},{"$error":"#N/A"},{"$error":"#N/A"},{"$error":"#N/A"},23,1,0,0]
[12,"_ _",22,null,null,22,null,12,"_ _",22,null,null,22,null,12,null,"","",null,0,{"$error":"#N/A"},{"$error":"#N/A"},{"$error":"#N/A"},{"$error":"#N/A"},{"$error":"#N/A"},22,1,0,0]
[13,"_ _",21,null,null,21,null,13,"_ _",21,null,null,21,null,13,null,"","",null,0,{"$error":"#N/A"},{"$error":"#N/A"},{"$error":"#N/A"},{"$error":"#N/A"},{"$error":"#N/A"},21,1,0,0]
[14,"_ _",20,null,null,20,null,14,"_ _",20,null,null,20,null,14,null,"","",null,0,{"$error":"#N/A"},{"$error":"#N/A"},{"$error":"#N/A"},{"$error":"#N/A"},{"$error":"#N/A"},20,1,0,0]
[15,"_ _",19,null,null,19,null,15,"_ _",19,null,null,19,null,15,null,"","",null,0,{"$error":"#N/A"},{"$error":"#N/A"},{"$error":"#N/A"},{"$error":"#N/A"},{"$error":"#N/A"},19,1,0,0]
[16,"_ _",18,null,null,18,null,16,"_ _",18,null,null,18,null,16,null,"","",null,0,{"$error":"#N/A"},{"$error":"#N/A"},{"$error":"#N/A"},{"$error":"#N/A"},{"$error":"#N/A"},18,1,0,0]
[17,"_ _",17,null,null,17,null,17,"_ _",17,null,null,17,null,17,null,"","",null,0,{"$error":"#N/A"},{"$error":"#N/A"},{"$error":"#N/A"},{"$error":"#N/A"},{"$error":"#N/A"},17,1,0,0]
[18,"_ _",16,null,null,16,null,18,"_ _",16,null,null,16,null,18,null,"","",null,0,{"$error":"#N/A"},{"$error":"#N/A"},{"$error":"#N/A"},{"$error":"#N/A"},{"$error":"#N/A"},16,1,0,0]
[19,"_ _",15,null,null,15,null,19,"_ _",15,null,null,15,null,19,null,"","",null,0,{"$error":"#N/A"},{"$error":"#N/A"},{"$error":"#N/A"},{"$error":"#N/A"},{"$error":"#N/A"},15,1,0,0]
[20,"_ _",14,null,null,14,null,20,"_ _",14,null,null,14,null,20,null,"","",null,0,{"$error":"#N/A"},{"$error":"#N/A"},{"$error":"#N/A"},{"$error":"#N/A"},{"$error":"#N/A"},14,1,0,0]
[21,"_ _",13,null,null,13,null,21,"_ _",13,null,null,13,null,21,null,"","",null,0,{"$error":"#N/A"},{"$error":"#N/A"},{"$error":"#N/A"},{"$error":"#N/A"},{"$error":"#N/A"},13,1,0,0]
[22,"_ _",12,null,null,12,null,22,"_ _",12,null,null,12,null,22,null,"","",null,0,{"$error":"#N/A"},{"$error":"#N/A"},{"$error":"#N/A"},{"$error":"#N/A"},{"$error":"#N/A"},12,1,0,0]
[23,"_ _",11,null,null,11,null,23,"_ _",11,null,null,11,null,23,null,"","",null,0,{"$error":"#N/A"},{"$error":"#N/A"},{"$error":"#N/A"},{"$error":"#N/A"},{"$error":"#N/A"},11,1,0,0]
[24,"_ _",10,null,null,10,null,24,"_ _",10,null,null,10,null,24,null,"","",null,0,{"$error":"#N/A"},{"$error":"#N/A"},{"$error":"#N/A"},{"$error":"#N/A"},{"$error":"#N/A"},10,1,0,0]
[25,"_ _",9,null,null,9,null,25,"_ _",9,null,null,9,null,25,null,"","",null,0,{"$error":"#N/A"},{"$error":"#N/A"},{"$error":"#N/A"},{"$error":"#N/A"},{"$error":"#N/A"},9,1,0,0]
[26,"_ _",8,null,null,8,null,26,"_ _",8,null,null,8,null,26,null,"","",null,0,{"$error":"#N/A"},{"$error":"#N/A"},{"$error":"#N/A"},{"$error":"#N/A"},{"$error":"#N/A"},8,1,0,0]
[27,"_ _",7,null,null,7,null,27,"_ _",7,null,null,7,null,27,null,"","",null,0,{"$error":"#N/A"},{"$error":"#N/A"},{"$error":"#N/A"},{"$error":"#N/A"},{"$error":"#N/A"},7,1,0,0]
[28,"_ _",6,null,null,6,null,28,"_ _",6,null,null,6,null,28,null,"","",null,0,{"$error":"#N/A"},{"$error":"#N/A"},{"$error":"#N/A"},{"$error":"#N/A"},{"$error":"#N/A"},6,1,0,0]
[29,"_ _",5,null,null,5,null,29,"_ _",5,null,null,5,null,29,null,"","",null,0,{"$error":"#N/A"},{"$error":"#N/A"},{"$error":"#N/A"},{"$error":"#N/A"},{"$error":"#N/A"},5,1,0,0]
[30,"_ _",4,null,null,4,null,30,"_ _",4,null,null,4,null,30,null,"","",null,0,{"$error":"#N/A"},{"$error":"#N/A"},{"$error":"#N/A"},{"$error":"#N/A"},{"$error":"#N/A"},4,1,0,0]
[31,"_ _",3,null,null,3,null,31,"_ _",3,null,null,3,null,31,null,"","",null,0,{"$error":"#N/A"},{"$error":"#N/A"},{"$error":"#N/A"},{"$error":"#N/A"},{"$error":"#N/A"},3,1,0,0]
[32,"_ _",2,null,null,2,null,32,"_ _",2,null,null,2,null,32,null,"","",null,0,{"$error":"#N/A"},{"$error":"#N/A"},{"$error":"#N/A"},{"$error":"#N/A"},{"$error":"#N/A"},2,1,0,0]
[33,"_ _",1,null,null,1,null,33,"_ _",1,null,null,1,null,33,null,"","",null,0,{"$error":"#N/A"},{"$error":"#N/A"},{"$error":"#N/A"},{"$error":"#N/A"},{"$error":"#N/A"},1,1,0,0]
[34,"_ _",1,null,null,1,null,34,"_ _",1,null,null,1,null,34,null,"","",null,0,{"$error":"#N/A"},{"$error":"#N/A"},{"$error":"#N/A"},{"$error":"#N/A"},{"$error":"#N/A"},1,1,0,0]
[35,"_ _",1,null,null,1,null,35,"_ _",1,null,null,1,null,35,null,"","",null,0,{"$error":"#N/A"},{"$error":"#N/A"},{"$error":"#N/A"},{"$error":"#N/A"},{"$error":"#N/A"},1,1,0,0]
[36,"_ _",1,null,null,1,null,36,"_ _",1,null,null,1,null,36,null,"","",null,0,{"$error":"#N/A"},{"$error":"#N/A"},{"$error":"#N/A"},{"$error":"#N/A"},{"$error":"#N/A"},1,1,0,0]
[37,"_ _",1,null,null,1,null,37,"_ _",1,null,null,1,null,37,null,"","",null,0,{"$error":"#N/A"},{"$error":"#N/A"},{"$error":"#N/A"},{"$error":"#N/A"},{"$error":"#N/A"},1,1,0,0]
[38,"_ _",1,null,null,1,null,38,"_ _",1,null,null,1,null,38,null,"","",null,0,{"$error":"#N/A"},{"$error":"#N/A"},{"$error":"#N/A"},{"$error":"#N/A"},{"$error":"#N/A"},1,1,0,0]
[39,"_ _",1,null,null,1,null,39,"_ _",1,null,null,1,null,39,null,"","",null,0,{"$error":"#N/A"},{"$error":"#N/A"},{"$error":"#N/A"},{"$error":"#N/A"},{"$error":"#N/A"},1,1,0,0]
[40,"_ _",1,null,null,1,null,40,"_ _",1,null,null,1,null,40,null,"","",null,0,{"$error":"#N/A"},{"$error":"#N/A"},{"$error":"#N/A"},{"$error":"#N/A"},{"$error":"#N/A"},1,1,0,0]
[41,"_ _",1,null,null,1,null,41,"_ _",1,null,null,1,null,41,null,"","",null,0,{"$error":"#N/A"},{"$error":"#N/A"},{"$error":"#N/A"},{"$error":"#N/A"},{"$error":"#N/A"},1,1,0,0]
[42,"_ _",1,null,null,1,null,42,"_ _",1,null,null,1,null,42,null,"","",null,0,{"$error":"#N/A"},{"$error":"#N/A"},{"$error":"#N/A"},{"$error":"#N/A"},{"$error":"#N/A"},1,1,0,0]
[43,"_ _",1,null,null,1,null,43,"_ _",1,null,null,1,null,43,null,"","",null,0,{"$error":"#N/A"},{"$error":"#N/A"},{"$error":"#N/A"},{"$error":"#N/A"},{"$error":"#N/A"},1,1,0,0]
[44,"_ _",1,null,null,1,null,44,"_ _",1,null,null,1,null,44,null,"","",null,0,{"$error":"#N/A"},{"$error":"#N/A"},{"$error":"#N/A"},{"$error":"#N/A"},{"$error":"#N/A"},1,1,0,0]
[45,"_ _",1,null,null,1,null,45,"_ _",1,null,null,1,null,45,null,"","",null,0,{"$error":"#N/A"},{"$error":"#N/A"},{"$error":"#N/A"},{"$error":"#N/A"},{"$error":"#N/A"},1,1,0,0]

{"sheet":"EKC4","index":5,"n_rows":48,"n_cols":29,"rows_kept":48,"cut":false,"hidden":false,"merged":[[1,21,1,22],[1,23,1,25]]}
[null,"Course 1",null,null,null,null,null,null,"Course 2",null,null,null,null,null,null,"Classement Global"]
[null,null,null,null,null,null,null,null,null,null,null,null,null,null,null,null,null,null,null,null,null,"C1",null,"C2"]
["Classt","Equipe","Points","Pole","MT","Total",null,"Classt","Equipe","Points","Pole","MT","Total",null,"Classt","Equipe","M1","M2","Best","Calcul","Total","Pole","MT","Pole","MT","Points",null,{"$f":"SUM(AB4:AB48)","v":0}]
[1,"_ _",35,null,null,{"$f":"C4+D4+E4","v":35},null,1,"_ _",35,null,null,{"$f":"J4+K4+L4","v":35},null,1,null,{"$f":"IF(ISNA(VLOOKUP($P4,$B$4:$F$48,5,FALSE)),\"\",VLOOKUP($P4,$B$4:$F$48,5,FALSE))","v":""},{"$f":"IF(ISNA(VLOOKUP($P4,$I$4:$M$48,5,FALSE)),\"\",VLOOKUP($P4,$I$4:$M$48,5,FALSE))","v":""},null,{"$f":"IF(ISERROR(Q4+R4),0,(Q4+R4))+IF(ISBLANK(S4),0,AC4)","v":0},{"$f":"SUM(V4:Z4)","v":{"$error":"#N/A"}},{"$f":"VLOOKUP($P4,$B$4:$E$48,3,FALSE)","v":{"$error":"#N/A"}},{"$f":"VLOOKUP($P4,$B$4:$E$48,4,FALSE)","v":{"$error":"#N/A"}},{"$f":"VLOOKUP($P4,$I$4:$L$48,3,FALSE)","v":{"$error":"#N/A"}},{"$f":"VLOOKUP($P4,$I$4:$L$48,4,FALSE)","v":{"$error":"#N/A"}},35,1,{"$f":"IF(P4=0,0,1)","v":0},{"$f":"IF(ISBLANK(S4),0,1-(S4/10))","v":0}]
[2,"_ _",33,null,null,{"$f":"C5+D5+E5","v":33},null,2,"_ _",33,null,null,{"$f":"J5+K5+L5","v":33},null,2,null,"","",null,0,{"$f":"SUM(V5:Z5)","v":{"$error":"#N/A"}},{"$f":"VLOOKUP($P5,$B$4:$E$48,3,FALSE)","v":{"$error":"#N/A"}},{"$f":"VLOOKUP($P5,$B$4:$E$48,4,FALSE)","v":{"$error":"#N/A"}},{"$f":"VLOOKUP($P5,$I$4:$L$48,3,FALSE)","v":{"$error":"#N/A"}},{"$f":"VLOOKUP($P5,$I$4:$L$48,4,FALSE)","v":{"$error":"#N/A"}},33,1,0,0]
[3,"_ _",31,null,null,31,null,3,"_ _",31,null,null,31,null,3,null,"","",null,0,{"$error":"#N/A"},{"$error":"#N/A"},{"$error":"#N/A"},{"$error":"#N/A"},{"$error":"#N/A"},31,1,0,0]
[4,"_ _",30,null,null,30,null,4,"_ _",30,null,null,30,null,4,null,"","",null,0,{"$error":"#N/A"},{"$error":"#N/A"},{"$error":"#N/A"},{"$error":"#N/A"},{"$error":"#N/A"},30,1,0,0]
[5,"_ _",29,null,null,29,null,5,"_ _",29,null,null,29,null,5,null,"","",null,0,{"$error":"#N/A"},{"$error":"#N/A"},{"$error":"#N/A"},{"$error":"#N/A"},{"$error":"#N/A"},29,1,0,0]
[6,"_ _",28,null,null,28,null,6,"_ _",28,null,null,28,null,6,null,"","",null,0,{"$error":"#N/A"},{"$error":"#N/A"},{"$error":"#N/A"},{"$error":"#N/A"},{"$error":"#N/A"},28,1,0,0]
[7,"_ _",27,null,null,27,null,7,"_ _",27,null,null,27,null,7,null,"","",null,0,{"$error":"#N/A"},{"$error":"#N/A"},{"$error":"#N/A"},{"$error":"#N/A"},{"$error":"#N/A"},27,1,0,{"$f":"IF(ISBLANK(S10),0,1-(S10/10))","v":0}]
[8,"_ _",26,null,null,26,null,8,"_ _",26,null,null,26,null,8,null,"","",null,0,{"$error":"#N/A"},{"$error":"#N/A"},{"$error":"#N/A"},{"$error":"#N/A"},{"$error":"#N/A"},26,1,{"$f":"IF(P11=0,0,1)","v":0},0]
[9,"_ _",25,null,null,25,null,9,"_ _",25,null,null,25,null,9,null,"","",null,0,{"$error":"#N/A"},{"$error":"#N/A"},{"$error":"#N/A"},{"$error":"#N/A"},{"$error":"#N/A"},25,1,0,0]
[10,"_ _",24,null,null,24,null,10,"_ _",24,null,null,24,null,10,null,"","",null,0,{"$error":"#N/A"},{"$error":"#N/A"},{"$error":"#N/A"},{"$error":"#N/A"},{"$error":"#N/A"},24,1,0,0]
[11,"_ _",23,null,null,23,null,11,"_ _",23,null,null,23,null,11,null,"","",null,0,{"$error":"#N/A"},{"$error":"#N/A"},{"$error":"#N/A"},{"$error":"#N/A"},{"$error":"#N/A"},23,1,0,0]
[12,"_ _",22,null,null,22,null,12,"_ _",22,null,null,22,null,12,null,"","",null,0,{"$error":"#N/A"},{"$error":"#N/A"},{"$error":"#N/A"},{"$error":"#N/A"},{"$error":"#N/A"},22,1,0,0]
[13,"_ _",21,null,null,21,null,13,"_ _",21,null,null,21,null,13,null,"","",null,0,{"$error":"#N/A"},{"$error":"#N/A"},{"$error":"#N/A"},{"$error":"#N/A"},{"$error":"#N/A"},21,1,0,0]
[14,"_ _",20,null,null,20,null,14,"_ _",20,null,null,20,null,14,null,"","",null,0,{"$error":"#N/A"},{"$error":"#N/A"},{"$error":"#N/A"},{"$error":"#N/A"},{"$error":"#N/A"},20,1,0,0]
[15,"_ _",19,null,null,19,null,15,"_ _",19,null,null,19,null,15,null,"","",null,0,{"$error":"#N/A"},{"$error":"#N/A"},{"$error":"#N/A"},{"$error":"#N/A"},{"$error":"#N/A"},19,1,0,0]
[16,"_ _",18,null,null,18,null,16,"_ _",18,null,null,18,null,16,null,"","",null,0,{"$error":"#N/A"},{"$error":"#N/A"},{"$error":"#N/A"},{"$error":"#N/A"},{"$error":"#N/A"},18,1,0,0]
[17,"_ _",17,null,null,17,null,17,"_ _",17,null,null,17,null,17,null,"","",null,0,{"$error":"#N/A"},{"$error":"#N/A"},{"$error":"#N/A"},{"$error":"#N/A"},{"$error":"#N/A"},17,1,0,0]
[18,"_ _",16,null,null,16,null,18,"_ _",16,null,null,16,null,18,null,"","",null,0,{"$error":"#N/A"},{"$error":"#N/A"},{"$error":"#N/A"},{"$error":"#N/A"},{"$error":"#N/A"},16,1,0,0]
[19,"_ _",15,null,null,15,null,19,"_ _",15,null,null,15,null,19,null,"","",null,0,{"$error":"#N/A"},{"$error":"#N/A"},{"$error":"#N/A"},{"$error":"#N/A"},{"$error":"#N/A"},15,1,0,0]
[20,"_ _",14,null,null,14,null,20,"_ _",14,null,null,14,null,20,null,"","",null,0,{"$error":"#N/A"},{"$error":"#N/A"},{"$error":"#N/A"},{"$error":"#N/A"},{"$error":"#N/A"},14,1,0,0]
[21,"_ _",13,null,null,13,null,21,"_ _",13,null,null,13,null,21,null,"","",null,0,{"$error":"#N/A"},{"$error":"#N/A"},{"$error":"#N/A"},{"$error":"#N/A"},{"$error":"#N/A"},13,1,0,0]
[22,"_ _",12,null,null,12,null,22,"_ _",12,null,null,12,null,22,null,"","",null,0,{"$error":"#N/A"},{"$error":"#N/A"},{"$error":"#N/A"},{"$error":"#N/A"},{"$error":"#N/A"},12,1,0,0]
[23,"_ _",11,null,null,11,null,23,"_ _",11,null,null,11,null,23,null,"","",null,0,{"$error":"#N/A"},{"$error":"#N/A"},{"$error":"#N/A"},{"$error":"#N/A"},{"$error":"#N/A"},11,1,0,0]
[24,"_ _",10,null,null,10,null,24,"_ _",10,null,null,10,null,24,null,"","",null,0,{"$error":"#N/A"},{"$error":"#N/A"},{"$error":"#N/A"},{"$error":"#N/A"},{"$error":"#N/A"},10,1,0,0]
[25,"_ _",9,null,null,9,null,25,"_ _",9,null,null,9,null,25,null,"","",null,0,{"$error":"#N/A"},{"$error":"#N/A"},{"$error":"#N/A"},{"$error":"#N/A"},{"$error":"#N/A"},9,1,0,0]
[26,"_ _",8,null,null,8,null,26,"_ _",8,null,null,8,null,26,null,"","",null,0,{"$error":"#N/A"},{"$error":"#N/A"},{"$error":"#N/A"},{"$error":"#N/A"},{"$error":"#N/A"},8,1,0,0]
[27,"_ _",7,null,null,7,null,27,"_ _",7,null,null,7,null,27,null,"","",null,0,{"$error":"#N/A"},{"$error":"#N/A"},{"$error":"#N/A"},{"$error":"#N/A"},{"$error":"#N/A"},7,1,0,0]
[28,"_ _",6,null,null,6,null,28,"_ _",6,null,null,6,null,28,null,"","",null,0,{"$error":"#N/A"},{"$error":"#N/A"},{"$error":"#N/A"},{"$error":"#N/A"},{"$error":"#N/A"},6,1,0,0]
[29,"_ _",5,null,null,5,null,29,"_ _",5,null,null,5,null,29,null,"","",null,0,{"$error":"#N/A"},{"$error":"#N/A"},{"$error":"#N/A"},{"$error":"#N/A"},{"$error":"#N/A"},5,1,0,0]
[30,"_ _",4,null,null,4,null,30,"_ _",4,null,null,4,null,30,null,"","",null,0,{"$error":"#N/A"},{"$error":"#N/A"},{"$error":"#N/A"},{"$error":"#N/A"},{"$error":"#N/A"},4,1,0,0]
[31,"_ _",3,null,null,3,null,31,"_ _",3,null,null,3,null,31,null,"","",null,0,{"$error":"#N/A"},{"$error":"#N/A"},{"$error":"#N/A"},{"$error":"#N/A"},{"$error":"#N/A"},3,1,0,0]
[32,"_ _",2,null,null,2,null,32,"_ _",2,null,null,2,null,32,null,"","",null,0,{"$error":"#N/A"},{"$error":"#N/A"},{"$error":"#N/A"},{"$error":"#N/A"},{"$error":"#N/A"},2,1,0,0]
[33,"_ _",1,null,null,1,null,33,"_ _",1,null,null,1,null,33,null,"","",null,0,{"$error":"#N/A"},{"$error":"#N/A"},{"$error":"#N/A"},{"$error":"#N/A"},{"$error":"#N/A"},1,1,0,0]
[34,"_ _",1,null,null,1,null,34,"_ _",1,null,null,1,null,34,null,"","",null,0,{"$error":"#N/A"},{"$error":"#N/A"},{"$error":"#N/A"},{"$error":"#N/A"},{"$error":"#N/A"},1,1,0,0]
[35,"_ _",1,null,null,1,null,35,"_ _",1,null,null,1,null,35,null,"","",null,0,{"$error":"#N/A"},{"$error":"#N/A"},{"$error":"#N/A"},{"$error":"#N/A"},{"$error":"#N/A"},1,1,0,0]
[36,"_ _",1,null,null,1,null,36,"_ _",1,null,null,1,null,36,null,"","",null,0,{"$error":"#N/A"},{"$error":"#N/A"},{"$error":"#N/A"},{"$error":"#N/A"},{"$error":"#N/A"},1,1,0,0]
[37,"_ _",1,null,null,1,null,37,"_ _",1,null,null,1,null,37,null,"","",null,0,{"$error":"#N/A"},{"$error":"#N/A"},{"$error":"#N/A"},{"$error":"#N/A"},{"$error":"#N/A"},1,1,0,0]
[38,"_ _",1,null,null,1,null,38,"_ _",1,null,null,1,null,38,null,"","",null,0,{"$error":"#N/A"},{"$error":"#N/A"},{"$error":"#N/A"},{"$error":"#N/A"},{"$error":"#N/A"},1,1,0,0]
[39,"_ _",1,null,null,1,null,39,"_ _",1,null,null,1,null,39,null,"","",null,0,{"$error":"#N/A"},{"$error":"#N/A"},{"$error":"#N/A"},{"$error":"#N/A"},{"$error":"#N/A"},1,1,0,0]
[40,"_ _",1,null,null,1,null,40,"_ _",1,null,null,1,null,40,null,"","",null,0,{"$error":"#N/A"},{"$error":"#N/A"},{"$error":"#N/A"},{"$error":"#N/A"},{"$error":"#N/A"},1,1,0,0]
[41,"_ _",1,null,null,1,null,41,"_ _",1,null,null,1,null,41,null,"","",null,0,{"$error":"#N/A"},{"$error":"#N/A"},{"$error":"#N/A"},{"$error":"#N/A"},{"$error":"#N/A"},1,1,0,0]
[42,"_ _",1,null,null,1,null,42,"_ _",1,null,null,1,null,42,null,"","",null,0,{"$error":"#N/A"},{"$error":"#N/A"},{"$error":"#N/A"},{"$error":"#N/A"},{"$error":"#N/A"},1,1,0,0]
[43,"_ _",1,null,null,1,null,43,"_ _",1,null,null,1,null,43,null,"","",null,0,{"$error":"#N/A"},{"$error":"#N/A"},{"$error":"#N/A"},{"$error":"#N/A"},{"$error":"#N/A"},1,1,0,0]
[44,"_ _",1,null,null,1,null,44,"_ _",1,null,null,1,null,44,null,"","",null,0,{"$error":"#N/A"},{"$error":"#N/A"},{"$error":"#N/A"},{"$error":"#N/A"},{"$error":"#N/A"},1,1,0,0]
[45,"_ _",1,null,null,1,null,45,"_ _",1,null,null,1,null,45,null,"","",null,0,{"$error":"#N/A"},{"$error":"#N/A"},{"$error":"#N/A"},{"$error":"#N/A"},{"$error":"#N/A"},1,1,0,0]

{"sheet":"EKC5","index":6,"n_rows":48,"n_cols":29,"rows_kept":48,"cut":false,"hidden":false,"merged":[[1,21,1,22],[1,23,1,25]]}
[null,"Course 1",null,null,null,null,null,null,"Course 2",null,null,null,null,null,null,"Classement Global"]
[null,null,null,null,null,null,null,null,null,null,null,null,null,null,null,null,null,null,null,null,null,"C1",null,"C2"]
["Classt","Equipe","Points","Pole","MT","Total",null,"Classt","Equipe","Points","Pole","MT","Total",null,"Classt","Equipe","M1","M2","Best","Calcul","Total","Pole","MT","Pole","MT","Points",null,{"$f":"SUM(AB4:AB48)","v":0}]
[1,"_ _",35,null,null,{"$f":"C4+D4+E4","v":35},null,1,"_ _",35,null,null,{"$f":"J4+K4+L4","v":35},null,1,null,{"$f":"IF(ISNA(VLOOKUP($P4,$B$4:$F$48,5,FALSE)),\"\",VLOOKUP($P4,$B$4:$F$48,5,FALSE))","v":""},{"$f":"IF(ISNA(VLOOKUP($P4,$I$4:$M$48,5,FALSE)),\"\",VLOOKUP($P4,$I$4:$M$48,5,FALSE))","v":""},null,{"$f":"IF(ISERROR(Q4+R4),0,(Q4+R4))+IF(ISBLANK(S4),0,AC4)","v":0},{"$f":"SUM(V4:Z4)","v":{"$error":"#N/A"}},{"$f":"VLOOKUP($P4,$B$4:$E$48,3,FALSE)","v":{"$error":"#N/A"}},{"$f":"VLOOKUP($P4,$B$4:$E$48,4,FALSE)","v":{"$error":"#N/A"}},{"$f":"VLOOKUP($P4,$I$4:$L$48,3,FALSE)","v":{"$error":"#N/A"}},{"$f":"VLOOKUP($P4,$I$4:$L$48,4,FALSE)","v":{"$error":"#N/A"}},35,1,{"$f":"IF(P4=0,0,1)","v":0},{"$f":"IF(ISBLANK(S4),0,1-(S4/10))","v":0}]
[2,"_ _",33,null,null,{"$f":"C5+D5+E5","v":33},null,2,"_ _",33,null,null,{"$f":"J5+K5+L5","v":33},null,2,null,"","",null,0,{"$f":"SUM(V5:Z5)","v":{"$error":"#N/A"}},{"$f":"VLOOKUP($P5,$B$4:$E$48,3,FALSE)","v":{"$error":"#N/A"}},{"$f":"VLOOKUP($P5,$B$4:$E$48,4,FALSE)","v":{"$error":"#N/A"}},{"$f":"VLOOKUP($P5,$I$4:$L$48,3,FALSE)","v":{"$error":"#N/A"}},{"$f":"VLOOKUP($P5,$I$4:$L$48,4,FALSE)","v":{"$error":"#N/A"}},33,1,0,0]
[3,"_ _",31,null,null,31,null,3,"_ _",31,null,null,31,null,3,null,"","",null,0,{"$error":"#N/A"},{"$error":"#N/A"},{"$error":"#N/A"},{"$error":"#N/A"},{"$error":"#N/A"},31,1,0,0]
[4,"_ _",30,null,null,30,null,4,"_ _",30,null,null,30,null,4,null,"","",null,0,{"$error":"#N/A"},{"$error":"#N/A"},{"$error":"#N/A"},{"$error":"#N/A"},{"$error":"#N/A"},30,1,0,0]
[5,"_ _",29,null,null,29,null,5,"_ _",29,null,null,29,null,5,null,"","",null,0,{"$error":"#N/A"},{"$error":"#N/A"},{"$error":"#N/A"},{"$error":"#N/A"},{"$error":"#N/A"},29,1,0,0]
[6,"_ _",28,null,null,28,null,6,"_ _",28,null,null,28,null,6,null,"","",null,0,{"$error":"#N/A"},{"$error":"#N/A"},{"$error":"#N/A"},{"$error":"#N/A"},{"$error":"#N/A"},28,1,0,0]
[7,"_ _",27,null,null,27,null,7,"_ _",27,null,null,27,null,7,null,"","",null,0,{"$error":"#N/A"},{"$error":"#N/A"},{"$error":"#N/A"},{"$error":"#N/A"},{"$error":"#N/A"},27,1,0,{"$f":"IF(ISBLANK(S10),0,1-(S10/10))","v":0}]
[8,"_ _",26,null,null,26,null,8,"_ _",26,null,null,26,null,8,null,"","",null,0,{"$error":"#N/A"},{"$error":"#N/A"},{"$error":"#N/A"},{"$error":"#N/A"},{"$error":"#N/A"},26,1,{"$f":"IF(P11=0,0,1)","v":0},0]
[9,"_ _",25,null,null,25,null,9,"_ _",25,null,null,25,null,9,null,"","",null,0,{"$error":"#N/A"},{"$error":"#N/A"},{"$error":"#N/A"},{"$error":"#N/A"},{"$error":"#N/A"},25,1,0,0]
[10,"_ _",24,null,null,24,null,10,"_ _",24,null,null,24,null,10,null,"","",null,0,{"$error":"#N/A"},{"$error":"#N/A"},{"$error":"#N/A"},{"$error":"#N/A"},{"$error":"#N/A"},24,1,0,0]
[11,"_ _",23,null,null,23,null,11,"_ _",23,null,null,23,null,11,null,"","",null,0,{"$error":"#N/A"},{"$error":"#N/A"},{"$error":"#N/A"},{"$error":"#N/A"},{"$error":"#N/A"},23,1,0,0]
[12,"_ _",22,null,null,22,null,12,"_ _",22,null,null,22,null,12,null,"","",null,0,{"$error":"#N/A"},{"$error":"#N/A"},{"$error":"#N/A"},{"$error":"#N/A"},{"$error":"#N/A"},22,1,0,0]
[13,"_ _",21,null,null,21,null,13,"_ _",21,null,null,21,null,13,null,"","",null,0,{"$error":"#N/A"},{"$error":"#N/A"},{"$error":"#N/A"},{"$error":"#N/A"},{"$error":"#N/A"},21,1,0,0]
[14,"_ _",20,null,null,20,null,14,"_ _",20,null,null,20,null,14,null,"","",null,0,{"$error":"#N/A"},{"$error":"#N/A"},{"$error":"#N/A"},{"$error":"#N/A"},{"$error":"#N/A"},20,1,0,0]
[15,"_ _",19,null,null,19,null,15,"_ _",19,null,null,19,null,15,null,"","",null,0,{"$error":"#N/A"},{"$error":"#N/A"},{"$error":"#N/A"},{"$error":"#N/A"},{"$error":"#N/A"},19,1,0,0]
[16,"_ _",18,null,null,18,null,16,"_ _",18,null,null,18,null,16,null,"","",null,0,{"$error":"#N/A"},{"$error":"#N/A"},{"$error":"#N/A"},{"$error":"#N/A"},{"$error":"#N/A"},18,1,0,0]
[17,"_ _",17,null,null,17,null,17,"_ _",17,null,null,17,null,17,null,"","",null,0,{"$error":"#N/A"},{"$error":"#N/A"},{"$error":"#N/A"},{"$error":"#N/A"},{"$error":"#N/A"},17,1,0,0]
[18,"_ _",16,null,null,16,null,18,"_ _",16,null,null,16,null,18,null,"","",null,0,{"$error":"#N/A"},{"$error":"#N/A"},{"$error":"#N/A"},{"$error":"#N/A"},{"$error":"#N/A"},16,1,0,0]
[19,"_ _",15,null,null,15,null,19,"_ _",15,null,null,15,null,19,null,"","",null,0,{"$error":"#N/A"},{"$error":"#N/A"},{"$error":"#N/A"},{"$error":"#N/A"},{"$error":"#N/A"},15,1,0,0]
[20,"_ _",14,null,null,14,null,20,"_ _",14,null,null,14,null,20,null,"","",null,0,{"$error":"#N/A"},{"$error":"#N/A"},{"$error":"#N/A"},{"$error":"#N/A"},{"$error":"#N/A"},14,1,0,0]
[21,"_ _",13,null,null,13,null,21,"_ _",13,null,null,13,null,21,null,"","",null,0,{"$error":"#N/A"},{"$error":"#N/A"},{"$error":"#N/A"},{"$error":"#N/A"},{"$error":"#N/A"},13,1,0,0]
[22,"_ _",12,null,null,12,null,22,"_ _",12,null,null,12,null,22,null,"","",null,0,{"$error":"#N/A"},{"$error":"#N/A"},{"$error":"#N/A"},{"$error":"#N/A"},{"$error":"#N/A"},12,1,0,0]
[23,"_ _",11,null,null,11,null,23,"_ _",11,null,null,11,null,23,null,"","",null,0,{"$error":"#N/A"},{"$error":"#N/A"},{"$error":"#N/A"},{"$error":"#N/A"},{"$error":"#N/A"},11,1,0,0]
[24,"_ _",10,null,null,10,null,24,"_ _",10,null,null,10,null,24,null,"","",null,0,{"$error":"#N/A"},{"$error":"#N/A"},{"$error":"#N/A"},{"$error":"#N/A"},{"$error":"#N/A"},10,1,0,0]
[25,"_ _",9,null,null,9,null,25,"_ _",9,null,null,9,null,25,null,"","",null,0,{"$error":"#N/A"},{"$error":"#N/A"},{"$error":"#N/A"},{"$error":"#N/A"},{"$error":"#N/A"},9,1,0,0]
[26,"_ _",8,null,null,8,null,26,"_ _",8,null,null,8,null,26,null,"","",null,0,{"$error":"#N/A"},{"$error":"#N/A"},{"$error":"#N/A"},{"$error":"#N/A"},{"$error":"#N/A"},8,1,0,0]
[27,"_ _",7,null,null,7,null,27,"_ _",7,null,null,7,null,27,null,"","",null,0,{"$error":"#N/A"},{"$error":"#N/A"},{"$error":"#N/A"},{"$error":"#N/A"},{"$error":"#N/A"},7,1,0,0]
[28,"_ _",6,null,null,6,null,28,"_ _",6,null,null,6,null,28,null,"","",null,0,{"$error":"#N/A"},{"$error":"#N/A"},{"$error":"#N/A"},{"$error":"#N/A"},{"$error":"#N/A"},6,1,0,0]
[29,"_ _",5,null,null,5,null,29,"_ _",5,null,null,5,null,29,null,"","",null,0,{"$error":"#N/A"},{"$error":"#N/A"},{"$error":"#N/A"},{"$error":"#N/A"},{"$error":"#N/A"},5,1,0,0]
[30,"_ _",4,null,null,4,null,30,"_ _",4,null,null,4,null,30,null,"","",null,0,{"$error":"#N/A"},{"$error":"#N/A"},{"$error":"#N/A"},{"$error":"#N/A"},{"$error":"#N/A"},4,1,0,0]
[31,"_ _",3,null,null,3,null,31,"_ _",3,null,null,3,null,31,null,"","",null,0,{"$error":"#N/A"},{"$error":"#N/A"},{"$error":"#N/A"},{"$error":"#N/A"},{"$error":"#N/A"},3,1,0,0]
[32,"_ _",2,null,null,2,null,32,"_ _",2,null,null,2,null,32,null,"","",null,0,{"$error":"#N/A"},{"$error":"#N/A"},{"$error":"#N/A"},{"$error":"#N/A"},{"$error":"#N/A"},2,1,0,0]
[33,"_ _",1,null,null,1,null,33,"_ _",1,null,null,1,null,33,null,"","",null,0,{"$error":"#N/A"},{"$error":"#N/A"},{"$error":"#N/A"},{"$error":"#N/A"},{"$error":"#N/A"},1,1,0,0]
[34,"_ _",1,null,null,1,null,34,"_ _",1,null,null,1,null,34,null,"","",null,0,{"$error":"#N/A"},{"$error":"#N/A"},{"$error":"#N/A"},{"$error":"#N/A"},{"$error":"#N/A"},1,1,0,0]
[35,"_ _",1,null,null,1,null,35,"_ _",1,null,null,1,null,35,null,"","",null,0,{"$error":"#N/A"},{"$error":"#N/A"},{"$error":"#N/A"},{"$error":"#N/A"},{"$error":"#N/A"},1,1,0,0]
[36,"_ _",1,null,null,1,null,36,"_ _",1,null,null,1,null,36,null,"","",null,0,{"$error":"#N/A"},{"$error":"#N/A"},{"$error":"#N/A"},{"$error":"#N/A"},{"$error":"#N/A"},1,1,0,0]
[37,"_ _",1,null,null,1,null,37,"_ _",1,null,null,1,null,37,null,"","",null,0,{"$error":"#N/A"},{"$error":"#N/A"},{"$error":"#N/A"},{"$error":"#N/A"},{"$error":"#N/A"},1,1,0,0]
[38,"_ _",1,null,null,1,null,38,"_ _",1,null,null,1,null,38,null,"","",null,0,{"$error":"#N/A"},{"$error":"#N/A"},{"$error":"#N/A"},{"$error":"#N/A"},{"$error":"#N/A"},1,1,0,0]
[39,"_ _",1,null,null,1,null,39,"_ _",1,null,null,1,null,39,null,"","",null,0,{"$error":"#N/A"},{"$error":"#N/A"},{"$error":"#N/A"},{"$error":"#N/A"},{"$error":"#N/A"},1,1,0,0]
[40,"_ _",1,null,null,1,null,40,"_ _",1,null,null,1,null,40,null,"","",null,0,{"$error":"#N/A"},{"$error":"#N/A"},{"$error":"#N/A"},{"$error":"#N/A"},{"$error":"#N/A"},1,1,0,0]
[41,"_ _",1,null,null,1,null,41,"_ _",1,null,null,1,null,41,null,"","",null,0,{"$error":"#N/A"},{"$error":"#N/A"},{"$error":"#N/A"},{"$error":"#N/A"},{"$error":"#N/A"},1,1,0,0]
[42,"_ _",1,null,null,1,null,42,"_ _",1,null,null,1,null,42,null,"","",null,0,{"$error":"#N/A"},{"$error":"#N/A"},{"$error":"#N/A"},{"$error":"#N/A"},{"$error":"#N/A"},1,1,0,0]
[43,"_ _",1,null,null,1,null,43,"_ _",1,null,null,1,null,43,null,"","",null,0,{"$error":"#N/A"},{"$error":"#N/A"},{"$error":"#N/A"},{"$error":"#N/A"},{"$error":"#N/A"},1,1,0,0]
[44,"_ _",1,null,null,1,null,44,"_ _",1,null,null,1,null,44,null,"","",null,0,{"$error":"#N/A"},{"$error":"#N/A"},{"$error":"#N/A"},{"$error":"#N/A"},{"$error":"#N/A"},1,1,0,0]
[45,"_ _",1,null,null,1,null,45,"_ _",1,null,null,1,null,45,null,"","",null,0,{"$error":"#N/A"},{"$error":"#N/A"},{"$error":"#N/A"},{"$error":"#N/A"},{"$error":"#N/A"},1,1,0,0]

{"sheet":"MODELE","index":7,"n_rows":48,"n_cols":29,"rows_kept":48,"cut":false,"hidden":false,"merged":[[1,21,1,22],[1,23,1,25]]}
[null,"Course 1",null,null,null,null,null,null,"Course 2",null,null,null,null,null,null,"Classement Global"]
[null,null,null,null,null,null,null,null,null,null,null,null,null,null,null,null,null,null,null,null,null,"C1",null,"C2"]
["Classt","Equipe","Points","Pole","MT","Total",null,"Classt","Equipe","Points","Pole","MT","Total",null,"Classt","Equipe","M1","M2","Best","Calcul","Total","Pole","MT","Pole","MT","Points",null,{"$f":"SUM(AB4:AB48)","v":0}]
[1,"_ _",35,null,null,{"$f":"C4+D4+E4","v":35},null,1,"_ _",35,null,null,{"$f":"J4+K4+L4","v":35},null,1,null,{"$f":"IF(ISNA(VLOOKUP($P4,$B$4:$F$48,5,FALSE)),\"\",VLOOKUP($P4,$B$4:$F$48,5,FALSE))","v":""},{"$f":"IF(ISNA(VLOOKUP($P4,$I$4:$M$48,5,FALSE)),\"\",VLOOKUP($P4,$I$4:$M$48,5,FALSE))","v":""},null,{"$f":"IF(ISERROR(Q4+R4),0,(Q4+R4))+IF(ISBLANK(S4),0,AC4)","v":0},{"$f":"SUM(V4:Z4)","v":{"$error":"#N/A"}},{"$f":"VLOOKUP($P4,$B$4:$E$48,3,FALSE)","v":{"$error":"#N/A"}},{"$f":"VLOOKUP($P4,$B$4:$E$48,4,FALSE)","v":{"$error":"#N/A"}},{"$f":"VLOOKUP($P4,$I$4:$L$48,3,FALSE)","v":{"$error":"#N/A"}},{"$f":"VLOOKUP($P4,$I$4:$L$48,4,FALSE)","v":{"$error":"#N/A"}},35,1,{"$f":"IF(P4=0,0,1)","v":0},{"$f":"IF(ISBLANK(S4),0,1-(S4/10))","v":0}]
[2,"_ _",33,null,null,{"$f":"C5+D5+E5","v":33},null,2,"_ _",33,null,null,{"$f":"J5+K5+L5","v":33},null,2,null,"","",null,0,{"$f":"SUM(V5:Z5)","v":{"$error":"#N/A"}},{"$f":"VLOOKUP($P5,$B$4:$E$48,3,FALSE)","v":{"$error":"#N/A"}},{"$f":"VLOOKUP($P5,$B$4:$E$48,4,FALSE)","v":{"$error":"#N/A"}},{"$f":"VLOOKUP($P5,$I$4:$L$48,3,FALSE)","v":{"$error":"#N/A"}},{"$f":"VLOOKUP($P5,$I$4:$L$48,4,FALSE)","v":{"$error":"#N/A"}},33,1,0,0]
[3,"_ _",31,null,null,31,null,3,"_ _",31,null,null,31,null,3,null,"","",null,0,{"$error":"#N/A"},{"$error":"#N/A"},{"$error":"#N/A"},{"$error":"#N/A"},{"$error":"#N/A"},31,1,0,0]
[4,"_ _",30,null,null,30,null,4,"_ _",30,null,null,30,null,4,null,"","",null,0,{"$error":"#N/A"},{"$error":"#N/A"},{"$error":"#N/A"},{"$error":"#N/A"},{"$error":"#N/A"},30,1,0,0]
[5,"_ _",29,null,null,29,null,5,"_ _",29,null,null,29,null,5,null,"","",null,0,{"$error":"#N/A"},{"$error":"#N/A"},{"$error":"#N/A"},{"$error":"#N/A"},{"$error":"#N/A"},29,1,0,0]
[6,"_ _",28,null,null,28,null,6,"_ _",28,null,null,28,null,6,null,"","",null,0,{"$error":"#N/A"},{"$error":"#N/A"},{"$error":"#N/A"},{"$error":"#N/A"},{"$error":"#N/A"},28,1,0,0]
[7,"_ _",27,null,null,27,null,7,"_ _",27,null,null,27,null,7,null,"","",null,0,{"$error":"#N/A"},{"$error":"#N/A"},{"$error":"#N/A"},{"$error":"#N/A"},{"$error":"#N/A"},27,1,0,{"$f":"IF(ISBLANK(S10),0,1-(S10/10))","v":0}]
[8,"_ _",26,null,null,26,null,8,"_ _",26,null,null,26,null,8,null,"","",null,0,{"$error":"#N/A"},{"$error":"#N/A"},{"$error":"#N/A"},{"$error":"#N/A"},{"$error":"#N/A"},26,1,{"$f":"IF(P11=0,0,1)","v":0},0]
[9,"_ _",25,null,null,25,null,9,"_ _",25,null,null,25,null,9,null,"","",null,0,{"$error":"#N/A"},{"$error":"#N/A"},{"$error":"#N/A"},{"$error":"#N/A"},{"$error":"#N/A"},25,1,0,0]
[10,"_ _",24,null,null,24,null,10,"_ _",24,null,null,24,null,10,null,"","",null,0,{"$error":"#N/A"},{"$error":"#N/A"},{"$error":"#N/A"},{"$error":"#N/A"},{"$error":"#N/A"},24,1,0,0]
[11,"_ _",23,null,null,23,null,11,"_ _",23,null,null,23,null,11,null,"","",null,0,{"$error":"#N/A"},{"$error":"#N/A"},{"$error":"#N/A"},{"$error":"#N/A"},{"$error":"#N/A"},23,1,0,0]
[12,"_ _",22,null,null,22,null,12,"_ _",22,null,null,22,null,12,null,"","",null,0,{"$error":"#N/A"},{"$error":"#N/A"},{"$error":"#N/A"},{"$error":"#N/A"},{"$error":"#N/A"},22,1,0,0]
[13,"_ _",21,null,null,21,null,13,"_ _",21,null,null,21,null,13,null,"","",null,0,{"$error":"#N/A"},{"$error":"#N/A"},{"$error":"#N/A"},{"$error":"#N/A"},{"$error":"#N/A"},21,1,0,0]
[14,"_ _",20,null,null,20,null,14,"_ _",20,null,null,20,null,14,null,"","",null,0,{"$error":"#N/A"},{"$error":"#N/A"},{"$error":"#N/A"},{"$error":"#N/A"},{"$error":"#N/A"},20,1,0,0]
[15,"_ _",19,null,null,19,null,15,"_ _",19,null,null,19,null,15,null,"","",null,0,{"$error":"#N/A"},{"$error":"#N/A"},{"$error":"#N/A"},{"$error":"#N/A"},{"$error":"#N/A"},19,1,0,0]
[16,"_ _",18,null,null,18,null,16,"_ _",18,null,null,18,null,16,null,"","",null,0,{"$error":"#N/A"},{"$error":"#N/A"},{"$error":"#N/A"},{"$error":"#N/A"},{"$error":"#N/A"},18,1,0,0]
[17,"_ _",17,null,null,17,null,17,"_ _",17,null,null,17,null,17,null,"","",null,0,{"$error":"#N/A"},{"$error":"#N/A"},{"$error":"#N/A"},{"$error":"#N/A"},{"$error":"#N/A"},17,1,0,0]
[18,"_ _",16,null,null,16,null,18,"_ _",16,null,null,16,null,18,null,"","",null,0,{"$error":"#N/A"},{"$error":"#N/A"},{"$error":"#N/A"},{"$error":"#N/A"},{"$error":"#N/A"},16,1,0,0]
[19,"_ _",15,null,null,15,null,19,"_ _",15,null,null,15,null,19,null,"","",null,0,{"$error":"#N/A"},{"$error":"#N/A"},{"$error":"#N/A"},{"$error":"#N/A"},{"$error":"#N/A"},15,1,0,0]
[20,"_ _",14,null,null,14,null,20,"_ _",14,null,null,14,null,20,null,"","",null,0,{"$error":"#N/A"},{"$error":"#N/A"},{"$error":"#N/A"},{"$error":"#N/A"},{"$error":"#N/A"},14,1,0,0]
[21,"_ _",13,null,null,13,null,21,"_ _",13,null,null,13,null,21,null,"","",null,0,{"$error":"#N/A"},{"$error":"#N/A"},{"$error":"#N/A"},{"$error":"#N/A"},{"$error":"#N/A"},13,1,0,0]
[22,"_ _",12,null,null,12,null,22,"_ _",12,null,null,12,null,22,null,"","",null,0,{"$error":"#N/A"},{"$error":"#N/A"},{"$error":"#N/A"},{"$error":"#N/A"},{"$error":"#N/A"},12,1,0,0]
[23,"_ _",11,null,null,11,null,23,"_ _",11,null,null,11,null,23,null,"","",null,0,{"$error":"#N/A"},{"$error":"#N/A"},{"$error":"#N/A"},{"$error":"#N/A"},{"$error":"#N/A"},11,1,0,0]
[24,"_ _",10,null,null,10,null,24,"_ _",10,null,null,10,null,24,null,"","",null,0,{"$error":"#N/A"},{"$error":"#N/A"},{"$error":"#N/A"},{"$error":"#N/A"},{"$error":"#N/A"},10,1,0,0]
[25,"_ _",9,null,null,9,null,25,"_ _",9,null,null,9,null,25,null,"","",null,0,{"$error":"#N/A"},{"$error":"#N/A"},{"$error":"#N/A"},{"$error":"#N/A"},{"$error":"#N/A"},9,1,0,0]
[26,"_ _",8,null,null,8,null,26,"_ _",8,null,null,8,null,26,null,"","",null,0,{"$error":"#N/A"},{"$error":"#N/A"},{"$error":"#N/A"},{"$error":"#N/A"},{"$error":"#N/A"},8,1,0,0]
[27,"_ _",7,null,null,7,null,27,"_ _",7,null,null,7,null,27,null,"","",null,0,{"$error":"#N/A"},{"$error":"#N/A"},{"$error":"#N/A"},{"$error":"#N/A"},{"$error":"#N/A"},7,1,0,0]
[28,"_ _",6,null,null,6,null,28,"_ _",6,null,null,6,null,28,null,"","",null,0,{"$error":"#N/A"},{"$error":"#N/A"},{"$error":"#N/A"},{"$error":"#N/A"},{"$error":"#N/A"},6,1,0,0]
[29,"_ _",5,null,null,5,null,29,"_ _",5,null,null,5,null,29,null,"","",null,0,{"$error":"#N/A"},{"$error":"#N/A"},{"$error":"#N/A"},{"$error":"#N/A"},{"$error":"#N/A"},5,1,0,0]
[30,"_ _",4,null,null,4,null,30,"_ _",4,null,null,4,null,30,null,"","",null,0,{"$error":"#N/A"},{"$error":"#N/A"},{"$error":"#N/A"},{"$error":"#N/A"},{"$error":"#N/A"},4,1,0,0]
[31,"_ _",3,null,null,3,null,31,"_ _",3,null,null,3,null,31,null,"","",null,0,{"$error":"#N/A"},{"$error":"#N/A"},{"$error":"#N/A"},{"$error":"#N/A"},{"$error":"#N/A"},3,1,0,0]
[32,"_ _",2,null,null,2,null,32,"_ _",2,null,null,2,null,32,null,"","",null,0,{"$error":"#N/A"},{"$error":"#N/A"},{"$error":"#N/A"},{"$error":"#N/A"},{"$error":"#N/A"},2,1,0,0]
[33,"_ _",1,null,null,1,null,33,"_ _",1,null,null,1,null,33,null,"","",null,0,{"$error":"#N/A"},{"$error":"#N/A"},{"$error":"#N/A"},{"$error":"#N/A"},{"$error":"#N/A"},1,1,0,0]
[34,"_ _",1,null,null,1,null,34,"_ _",1,null,null,1,null,34,null,"","",null,0,{"$error":"#N/A"},{"$error":"#N/A"},{"$error":"#N/A"},{"$error":"#N/A"},{"$error":"#N/A"},1,1,0,0]
[35,"_ _",1,null,null,1,null,35,"_ _",1,null,null,1,null,35,null,"","",null,0,{"$error":"#N/A"},{"$error":"#N/A"},{"$error":"#N/A"},{"$error":"#N/A"},{"$error":"#N/A"},1,1,0,0]
[36,"_ _",1,null,null,1,null,36,"_ _",1,null,null,1,null,36,null,"","",null,0,{"$error":"#N/A"},{"$error":"#N/A"},{"$error":"#N/A"},{"$error":"#N/A"},{"$error":"#N/A"},1,1,0,0]
[37,"_ _",1,null,null,1,null,37,"_ _",1,null,null,1,null,37,null,"","",null,0,{"$error":"#N/A"},{"$error":"#N/A"},{"$error":"#N/A"},{"$error":"#N/A"},{"$error":"#N/A"},1,1,0,0]
[38,"_ _",1,null,null,1,null,38,"_ _",1,null,null,1,null,38,null,"","",null,0,{"$error":"#N/A"},{"$error":"#N/A"},{"$error":"#N/A"},{"$error":"#N/A"},{"$error":"#N/A"},1,1,0,0]
[39,"_ _",1,null,null,1,null,39,"_ _",1,null,null,1,null,39,null,"","",null,0,{"$error":"#N/A"},{"$error":"#N/A"},{"$error":"#N/A"},{"$error":"#N/A"},{"$error":"#N/A"},1,1,0,0]
[40,"_ _",1,null,null,1,null,40,"_ _",1,null,null,1,null,40,null,"","",null,0,{"$error":"#N/A"},{"$error":"#N/A"},{"$error":"#N/A"},{"$error":"#N/A"},{"$error":"#N/A"},1,1,0,0]
[41,"_ _",1,null,null,1,null,41,"_ _",1,null,null,1,null,41,null,"","",null,0,{"$error":"#N/A"},{"$error":"#N/A"},{"$error":"#N/A"},{"$error":"#N/A"},{"$error":"#N/A"},1,1,0,0]
[42,"_ _",1,null,null,1,null,42,"_ _",1,null,null,1,null,42,null,"","",null,0,{"$error":"#N/A"},{"$error":"#N/A"},{"$error":"#N/A"},{"$error":"#N/A"},{"$error":"#N/A"},1,1,0,0]
[43,"_ _",1,null,null,1,null,43,"_ _",1,null,null,1,null,43,null,"","",null,0,{"$error":"#N/A"},{"$error":"#N/A"},{"$error":"#N/A"},{"$error":"#N/A"},{"$error":"#N/A"},1,1,0,0]
[44,"_ _",1,null,null,1,null,44,"_ _",1,null,null,1,null,44,null,"","",null,0,{"$error":"#N/A"},{"$error":"#N/A"},{"$error":"#N/A"},{"$error":"#N/A"},{"$error":"#N/A"},1,1,0,0]
[45,"_ _",1,null,null,1,null,45,"_ _",1,null,null,1,null,45,null,"","",null,0,{"$error":"#N/A"},{"$error":"#N/A"},{"$error":"#N/A"},{"$error":"#N/A"},{"$error":"#N/A"},1,1,0,0]

{"sheet":"Feuil3","index":8,"n_rows":0,"n_cols":0,"rows_kept":0,"cut":false,"hidden":false,"merged":[]}