{"text_format":"1","workbook":"xlsx","n_sheets":9,"sheets":["CLASSEMENT","EQUIPES","EKC1","EKC2","EKC3","EKC4","EKC5","MODELE","Feuil3"],"not_rendered":{"charts":0,"images":0,"macros":1,"external_links":1,"defined_names":0,"comments":0,"pivot_tables":0},"unopened":[],"bounds":{"document_bytes":16777216,"sheet_cells":100000,"rows_first":2000,"rows_last":500,"rows_between":2000,"halvings":0,"cell_chars":16384,"cell_head_chars":4096},"cells_cut":0,"cells_raw":0,"read":"whole","date_system":"1900"}

{"sheet":"CLASSEMENT","index":0,"n_rows":103,"n_cols":9,"rows_kept":103,"cut":false,"hidden":false,"merged":[]}
[null,null,"Nbr","Nbr","EKC 1 -RKC","EKC 2 - Circuit Europe","EKC 3 - Cap Karting","EKC 4 - Dunois Kart","EKC 5 - RKC"]
[null,null,"de ","de ",{"$f":"'EKC1'!AB3&\" équipes\"","v":"16 équipes"},{"$f":"'EKC2'!AB3&\" équipes\"","v":"0 équipes"},{"$f":"'EKC3'!AB3&\" équipes\"","v":"0 équipes"},{"$f":"'EKC4'!AB3&\" équipes\"","v":"0 équipes"},{"$f":"'EKC5'!AB3&\" équipes\"","v":"0 équipes"}]
["Clst","Equipes","Points","Courses","2 X  30mn  / 2H","2 X  30mn  / 2H","2 X  30mn  / 2H","2 X  30mn  / 2H","2 X  30mn  / 2H"]
[1,{"$f":"IF(EQUIPES!G10>0,EQUIPES!A10,\"\")","v":"JOKER TEAM"},{"$f":"SUM(E4:I4)","v":38},{"$f":"IF((COUNTIF(E4:I4,\">0\"))=0,\"\",COUNTIF(E4:I4,\">0\"))","v":1},{"$f":"IF(ISNA(VLOOKUP($B4,'EKC1'!$P$4:$U$48,6,FALSE)),\" \",VLOOKUP($B4,'EKC1'!$P$4:$U$48,6,FALSE))","v":38},{"$f":"IF(ISNA(VLOOKUP($B4,'EKC2'!$P$4:$V$48,6,FALSE)),\" \",VLOOKUP($B4,'EKC2'!$P$4:$V$48,6,FALSE))","v":" "},{"$f":"IF(ISNA(VLOOKUP($B4,'EKC3'!$P$4:$V$48,6,FALSE)),\" \",VLOOKUP($B4,'EKC3'!$P$4:$V$48,6,FALSE))","v":" "},{"$f":"IF(ISNA(VLOOKUP($B4,'EKC4'!$P$4:$V$48,6,FALSE)),\" \",VLOOKUP($B4,'EKC4'!$P$4:$V$48,6,FALSE))","v":" "},{"$f":"IF(ISNA(VLOOKUP($B4,'EKC5'!$P$4:$V$48,6,FALSE)),\" \",VLOOKUP($B4,'EKC5'!$P$4:$V$48,6,FALSE))","v":" "}]
[2,{"$f":"IF(EQUIPES!G6>0,EQUIPES!A6,\"\")","v":"ESSO SPORT"},33,1,{"$f":"IF(ISNA(VLOOKUP($B5,'EKC1'!$P$4:$U$48,6,FALSE)),\" \",VLOOKUP($B5,'EKC1'!$P$4:$U$48,6,FALSE))","v":33},{"$f":"IF(ISNA(VLOOKUP($B5,'EKC2'!$P$4:$V$48,6,FALSE)),\" \",VLOOKUP($B5,'EKC2'!$P$4:$V$48,6,FALSE))","v":" "},{"$f":"IF(ISNA(VLOOKUP($B5,'EKC3'!$P$4:$V$48,6,FALSE)),\" \",VLOOKUP($B5,'EKC3'!$P$4:$V$48,6,FALSE))","v":" "},{"$f":"IF(ISNA(VLOOKUP($B5,'EKC4'!$P$4:$V$48,6,FALSE)),\" \",VLOOKUP($B5,'EKC4'!$P$4:$V$48,6,FALSE))","v":" "},{"$f":"IF(ISNA(VLOOKUP($B5,'EKC5'!$P$4:$V$48,6,FALSE)),\" \",VLOOKUP($B5,'EKC5'!$P$4:$V$48,6,FALSE))","v":" "}]
[3,{"$f":"IF(EQUIPES!G17>0,EQUIPES!A17,\"\")","v":"TEAM TIME PENALTY"},32,1,{"$f":"IF(ISNA(VLOOKUP($B6,'EKC1'!$P$4:$U$48,6,FALSE)),\" \",VLOOKUP($B6,'EKC1'!$P$4:$U$48,6,FALSE))","v":32},{"$f":"IF(ISNA(VLOOKUP($B6,'EKC2'!$P$4:$V$48,6,FALSE)),\" \",VLOOKUP($B6,'EKC2'!$P$4:$V$48,6,FALSE))","v":" "},{"$f":"IF(ISNA(VLOOKUP($B6,'EKC3'!$P$4:$V$48,6,FALSE)),\" \",VLOOKUP($B6,'EKC3'!$P$4:$V$48,6,FALSE))","v":" "},{"$f":"IF(ISNA(VLOOKUP($B6,'EKC4'!$P$4:$V$48,6,FALSE)),\" \",VLOOKUP($B6,'EKC4'!$P$4:$V$48,6,FALSE))","v":" "},{"$f":"IF(ISNA(VLOOKUP($B6,'EKC5'!$P$4:$V$48,6,FALSE)),\" \",VLOOKUP($B6,'EKC5'!$P$4:$V$48,6,FALSE))","v":" "}]
[4,{"$f":"IF(EQUIPES!G13>0,EQUIPES!A13,\"\")","v":"MODAVE MRK PRO"},30,1,{"$f":"IF(ISNA(VLOOKUP($B7,'EKC1'!$P$4:$U$48,6,FALSE)),\" \",VLOOKUP($B7,'EKC1'!$P$4:$U$48,6,FALSE))","v":30},{"$f":"IF(ISNA(VLOOKUP($B7,'EKC2'!$P$4:$V$48,6,FALSE)),\" \",VLOOKUP($B7,'EKC2'!$P$4:$V$48,6,FALSE))","v":" "},{"$f":"IF(ISNA(VLOOKUP($B7,'EKC3'!$P$4:$V$48,6,FALSE)),\" \",VLOOKUP($B7,'EKC3'!$P$4:$V$48,6,FALSE))","v":" "},{"$f":"IF(ISNA(VLOOKUP($B7,'EKC4'!$P$4:$V$48,6,FALSE)),\" \",VLOOKUP($B7,'EKC4'!$P$4:$V$48,6,FALSE))","v":" "},{"$f":"IF(ISNA(VLOOKUP($B7,'EKC5'!$P$4:$V$48,6,FALSE)),\" \",VLOOKUP($B7,'EKC5'!$P$4:$V$48,6,FALSE))","v":" "}]
[5,{"$f":"IF(EQUIPES!G3>0,EQUIPES!A3,\"\")","v":"ALFA ROMEO RACING"},29,1,{"$f":"IF(ISNA(VLOOKUP($B8,'EKC1'!$P$4:$U$48,6,FALSE)),\" \",VLOOKUP($B8,'EKC1'!$P$4:$U$48,6,FALSE))","v":29},{"$f":"IF(ISNA(VLOOKUP($B8,'EKC2'!$P$4:$V$48,6,FALSE)),\" \",VLOOKUP($B8,'EKC2'!$P$4:$V$48,6,FALSE))","v":" "},{"$f":"IF(ISNA(VLOOKUP($B8,'EKC3'!$P$4:$V$48,6,FALSE)),\" \",VLOOKUP($B8,'EKC3'!$P$4:$V$48,6,FALSE))","v":" "},{"$f":"IF(ISNA(VLOOKUP($B8,'EKC4'!$P$4:$V$48,6,FALSE)),\" \",VLOOKUP($B8,'EKC4'!$P$4:$V$48,6,FALSE))","v":" "},{"$f":"IF(ISNA(VLOOKUP($B8,'EKC5'!$P$4:$V$48,6,FALSE)),\" \",VLOOKUP($B8,'EKC5'!$P$4:$V$48,6,FALSE))","v":" "}]
{"$rows_left_out":96}
{"sheet":"EQUIPES","index":1,"n_rows":201,"n_cols":11,"rows_kept":201,"cut":false,"hidden":false,"merged":[]}
["---",{"$f":"SUM(B2:B200)","v":16},{"$f":"SUM(C2:C200)","v":0},{"$f":"SUM(D2:D200)","v":0},{"$f":"SUM(E2:E200)","v":0},{"$f":"SUM(F2:F200)","v":0},{"$f":"COUNTIF(G3:G200,\">\"&0)","v":16},null,null,"Double saisie"]
["_ _",{"$f":"IF(ISNA(VLOOKUP($A2,'EKC1'!$P$4:$AA$48,5,FALSE)),\"\",VLOOKUP($A2,'EKC1'!$P$4:$AA$48,5,FALSE))","v":""},{"$f":"IF(ISNA(VLOOKUP($A2,'EKC2'!$P$4:$AA$48,5,FALSE)),\"\",VLOOKUP($A2,'EKC2'!$P$4:$AA$48,5,FALSE))","v":""},{"$f":"IF(ISNA(VLOOKUP($A2,'EKC3'!$P$4:$AA$48,5,FALSE)),\"\",VLOOKUP($A2,'EKC3'!$P$4:$AA$48,5,FALSE))","v":""},{"$f":"IF(ISNA(VLOOKUP($A2,'EKC4'!$P$4:$AA$48,5,FALSE)),\"\",VLOOKUP($A2,'EKC4'!$P$4:$AA$48,5,FALSE))","v":""},{"$f":"IF(ISNA(VLOOKUP($A2,'EKC5'!$P$4:$AA$48,5,FALSE)),\"\",VLOOKUP($A2,'EKC5'!$P$4:$AA$48,5,FALSE))","v":""},{"$f":"IF(SUM(B2:F2)=0,\"\",SUM(B2:F2))","v":""},null,null,{"$f":"SUM(J3:J200)","v":0}]
["ALFA ROMEO RACING",{"$f":"IF(ISNA(VLOOKUP($A3,'EKC1'!$P$4:$AB$48,12,FALSE)),\"\",VLOOKUP($A3,'EKC1'!$P$4:$AB$48,12,FALSE))","v":1},{"$f":"IF(ISNA(VLOOKUP($A3,'EKC2'!$P$4:$AB$48,12,FALSE)),\"\",VLOOKUP($A3,'EKC2'!$P$4:$AB$48,12,FALSE))","v":""},{"$f":"IF(ISNA(VLOOKUP($A3,'EKC3'!$P$4:$AB$48,12,FALSE)),\"\",VLOOKUP($A3,'EKC3'!$P$4:$AB$48,12,FALSE))","v":""},{"$f":"IF(ISNA(VLOOKUP($A3,'EKC4'!$P$4:$AB$48,12,FALSE)),\"\",VLOOKUP($A3,'EKC4'!$P$4:$AB$48,12,FALSE))","v":""},{"$f":"IF(ISNA(VLOOKUP($A3,'EKC5'!$P$4:$AB$48,12,FALSE)),\"\",VLOOKUP($A3,'EKC5'!$P$4:$AB$48,12,FALSE))","v":""},{"$f":"IF(SUM(B3:F3)=0,0,SUM(B3:F3))","v":1},null,null,{"$f":"IF(ISBLANK(A3),\"\",IF(A4=A3,1,\"\"))","v":""},{"$f":"IF(G3>0,1,0)","v":1}]
["CAEN VERANDAS",{"$f":"IF(ISNA(VLOOKUP($A4,'EKC1'!$P$4:$AB$48,12,FALSE)),\"\",VLOOKUP($A4,'EKC1'!$P$4:$AB$48,12,FALSE))","v":1},{"$f":"IF(ISNA(VLOOKUP($A4,'EKC2'!$P$4:$AB$48,12,FALSE)),\"\",VLOOKUP($A4,'EKC2'!$P$4:$AB$48,12,FALSE))","v":""},{"$f":"IF(ISNA(VLOOKUP($A4,'EKC3'!$P$4:$AB$48,12,FALSE)),\"\",VLOOKUP($A4,'EKC3'!$P$4:$AB$48,12,FALSE))","v":""},{"$f":"IF(ISNA(VLOOKUP($A4,'EKC4'!$P$4:$AB$48,12,FALSE)),\"\",VLOOKUP($A4,'EKC4'!$P$4:$AB$48,12,FALSE))","v":""},{"$f":"IF(ISNA(VLOOKUP($A4,'EKC5'!$P$4:$AB$48,12,FALSE)),\"\",VLOOKUP($A4,'EKC5'!$P$4:$AB$48,12,FALSE))","v":""},{"$f":"IF(SUM(B4:F4)=0,0,SUM(B4:F4))","v":1},null,null,{"$f":"IF(ISBLANK(A4),\"\",IF(A5=A4,1,\"\"))","v":""},{"$f":"IF(ISBLANK(A5),0,1)","v":1}]
["ERK TEAM",{"$f":"IF(ISNA(VLOOKUP($A5,'EKC1'!$P$4:$AB$48,12,FALSE)),\"\",VLOOKUP($A5,'EKC1'!$P$4:$AB$48,12,FALSE))","v":1},{"$f":"IF(ISNA(VLOOKUP($A5,'EKC2'!$P$4:$AB$48,12,FALSE)),\"\",VLOOKUP($A5,'EKC2'!$P$4:$AB$48,12,FALSE))","v":""},{"$f":"IF(ISNA(VLOOKUP($A5,'EKC3'!$P$4:$AB$48,12,FALSE)),\"\",VLOOKUP($A5,'EKC3'!$P$4:$AB$48,12,FALSE))","v":""},{"$f":"IF(ISNA(VLOOKUP($A5,'EKC4'!$P$4:$AB$48,12,FALSE)),\"\",VLOOKUP($A5,'EKC4'!$P$4:$AB$48,12,FALSE))","v":""},{"$f":"IF(ISNA(VLOOKUP($A5,'EKC5'!$P$4:$AB$48,12,FALSE)),\"\",VLOOKUP($A5,'EKC5'!$P$4:$AB$48,12,FALSE))","v":""},1,null,null,"",1]
["ESSO SPORT",{"$f":"IF(ISNA(VLOOKUP($A6,'EKC1'!$P$4:$AB$48,12,FALSE)),\"\",VLOOKUP($A6,'EKC1'!$P$4:$AB$48,12,FALSE))","v":1},{"$f":"IF(ISNA(VLOOKUP($A6,'EKC2'!$P$4:$AB$48,12,FALSE)),\"\",VLOOKUP($A6,'EKC2'!$P$4:$AB$48,12,FALSE))","v":""},{"$f":"IF(ISNA(VLOOKUP($A6,'EKC3'!$P$4:$AB$48,12,FALSE)),\"\",VLOOKUP($A6,'EKC3'!$P$4:$AB$48,12,FALSE))","v":""},{"$f":"IF(ISNA(VLOOKUP($A6,'EKC4'!$P$4:$AB$48,12,FALSE)),\"\",VLOOKUP($A6,'EKC4'!$P$4:$AB$48,12,FALSE))","v":""},{"$f":"IF(ISNA(VLOOKUP($A6,'EKC5'!$P$4:$AB$48,12,FALSE)),\"\",VLOOKUP($A6,'EKC5'!$P$4:$AB$48,12,FALSE))","v":""},1,null,null,"",1]
["FEEL EUROPE",{"$f":"IF(ISNA(VLOOKUP($A7,'EKC1'!$P$4:$AB$48,12,FALSE)),\"\",VLOOKUP($A7,'EKC1'!$P$4:$AB$48,12,FALSE))","v":1},{"$f":"IF(ISNA(VLOOKUP($A7,'EKC2'!$P$4:$AB$48,12,FALSE)),\"\",VLOOKUP($A7,'EKC2'!$P$4:$AB$48,12,FALSE))","v":""},{"$f":"IF(ISNA(VLOOKUP($A7,'EKC3'!$P$4:$AB$48,12,FALSE)),\"\",VLOOKUP($A7,'EKC3'!$P$4:$AB$48,12,FALSE))","v":""},{"$f":"IF(ISNA(VLOOKUP($A7,'EKC4'!$P$4:$AB$48,12,FALSE)),\"\",VLOOKUP($A7,'EKC4'!$P$4:$AB$48,12,FALSE))","v":""},{"$f":"IF(ISNA(VLOOKUP($A7,'EKC5'!$P$4:$AB$48,12,FALSE)),\"\",VLOOKUP($A7,'EKC5'!$P$4:$AB$48,12,FALSE))","v":""},1,null,null,"",1]
["JDB TEAM",{"$f":"IF(ISNA(VLOOKUP($A8,'EKC1'!$P$4:$AB$48,12,FALSE)),\"\",VLOOKUP($A8,'EKC1'!$P$4:$AB$48,12,FALSE))","v":1},{"$f":"IF(ISNA(VLOOKUP($A8,'EKC2'!$P$4:$AB$48,12,FALSE)),\"\",VLOOKUP($A8,'EKC2'!$P$4:$AB$48,12,FALSE))","v":""},{"$f":"IF(ISNA(VLOOKUP($A8,'EKC3'!$P$4:$AB$48,12,FALSE)),\"\",VLOOKUP($A8,'EKC3'!$P$4:$AB$48,12,FALSE))","v":""},{"$f":"IF(ISNA(VLOOKUP($A8,'EKC4'!$P$4:$AB$48,12,FALSE)),\"\",VLOOKUP($A8,'EKC4'!$P$4:$AB$48,12,FALSE))","v":""},{"$f":"IF(ISNA(VLOOKUP($A8,'EKC5'!$P$4:$AB$48,12,FALSE)),\"\",VLOOKUP($A8,'EKC5'!$P$4:$AB$48,12,FALSE))","v":""},1,null,null,"",1]
{"$rows_left_out":194}
{"sheet":"EKC1","index":2,"n_rows":48,"n_cols":29,"rows_kept":48,"cut":false,"hidden":false,"merged":[[1,21,1,22],[1,23,1,25]]}
[null,"Course 1",null,null,null,null,null,null,"Course 2",null,null,null,null,null,null,"Classement Global"]
[null,null,null,null,null,null,null,null,null,null,null,null,null,null,null,null,null,null,null,null,null,"C1",null,"C2"]
["Classt","Equipe","Points","Pole","MT","Total",null,"Classt","Equipe","Points","Pole","MT","Total",null,"Classt","Equipe","M1","M2","Best","Calcul","Total","Pole","MT","Pole","MT","Points",null,{"$f":"SUM(AB4:AB48)","v":16}]
[1,"TEAM TIME PENALTY",35,null,1,{"$f":"C4+D4+E4","v":36},null,1,"JOKER TEAM",35,1,1,{"$f":"J4+K4+L4","v":37},null,1,"JOKER TEAM",{"$f":"IF(ISNA(VLOOKUP($P4,$B$4:$F$48,5,FALSE)),\"\",VLOOKUP($P4,$B$4:$F$48,5,FALSE))","v":32},{"$f":"IF(ISNA(VLOOKUP($P4,$I$4:$M$48,5,FALSE)),\"\",VLOOKUP($P4,$I$4:$M$48,5,FALSE))","v":37},null,{"$f":"IF(ISERROR(Q4+R4),0,(Q4+R4))+IF(ISBLANK(S4),0,AC4)","v":69},{"$f":"SUM(V4:Z4)","v":38},{"$f":"VLOOKUP($P4,$B$4:$E$48,3,FALSE)","v":1},{"$f":"VLOOKUP($P4,$B$4:$E$48,4,FALSE)","v":0},{"$f":"VLOOKUP($P4,$I$4:$L$48,3,FALSE)","v":1},{"$f":"VLOOKUP($P4,$I$4:$L$48,4,FALSE)","v":1},35,1,{"$f":"IF(P4=0,0,1)","v":1},{"$f":"IF(ISBLANK(S4),0,1-(S4/10))","v":0}]
[2,"ESSO SPORT",33,null,null,{"$f":"C5+D5+E5","v":33},null,2,"ESSO SPORT",33,null,null,{"$f":"J5+K5+L5","v":33},null,2,"ESSO SPORT",33,33,null,66,{"$f":"SUM(V5:Z5)","v":33},{"$f":"VLOOKUP($P5,$B$4:$E$48,3,FALSE)","v":0},{"$f":"VLOOKUP($P5,$B$4:$E$48,4,FALSE)","v":0},{"$f":"VLOOKUP($P5,$I$4:$L$48,3,FALSE)","v":0},{"$f":"VLOOKUP($P5,$I$4:$L$48,4,FALSE)","v":0},33,1,1,0]
[3,"JOKER TEAM",31,1,null,32,null,3,"MODAVE MRK PRO",31,null,null,31,null,3,"TEAM TIME PENALTY",36,29,null,65,32,0,1,0,0,31,1,1,0]
[4,"ALFA ROMEO RACING",30,null,null,30,null,4,"ERK TEAM",30,null,null,30,null,4,"MODAVE MRK PRO",29,31,null,60,30,0,0,0,0,30,1,1,0]
[5,"MODAVE MRK PRO",29,null,null,29,null,5,"TEAM TIME PENALTY",29,null,null,29,null,5,"ALFA ROMEO RACING",30,27,null,57,29,0,0,0,0,29,1,1,0]
{"$rows_left_out":41}
{"sheet":"EKC2","index":3,"n_rows":48,"n_cols":29,"rows_kept":48,"cut":false,"hidden":false,"merged":[[1,21,1,22],[1,23,1,25]]}
[null,"Course 1",null,null,null,null,null,null,"Course 2",null,null,null,null,null,null,"Classement Global"]
[null,null,null,null,null,null,null,null,null,null,null,null,null,null,null,null,null,null,null,null,null,"C1",null,"C2"]
["Classt","Equipe","Points","Pole","MT","Total",null,"Classt","Equipe","Points","Pole","MT","Total",null,"Classt","Equipe","M1","M2","Best","Calcul","Total","Pole","MT","Pole","MT","Points",null,{"$f":"SUM(AB4:AB48)","v":0}]
[1,"_ _",35,null,null,{"$f":"C4+D4+E4","v":35},null,1,"_ _",35,null,null,{"$f":"J4+K4+L4","v":35},null,1,null,{"$f":"IF(ISNA(VLOOKUP($P4,$B$4:$F$48,5,FALSE)),\"\",VLOOKUP($P4,$B$4:$F$48,5,FALSE))","v":""},{"$f":"IF(ISNA(VLOOKUP($P4,$I$4:$M$48,5,FALSE)),\"\",VLOOKUP($P4,$I$4:$M$48,5,FALSE))","v":""},null,{"$f":"IF(ISERROR(Q4+R4),0,(Q4+R4))+IF(ISBLANK(S4),0,AC4)","v":0},{"$f":"SUM(V4:Z4)","v":{"$error":"#N/A"}},{"$f":"VLOOKUP($P4,$B$4:$E$48,3,FALSE)","v":{"$error":"#N/A"}},{"$f":"VLOOKUP($P4,$B$4:$E$48,4,FALSE)","v":{"$error":"#N/A"}},{"$f":"VLOOKUP($P4,$I$4:$L$48,3,FALSE)","v":{"$error":"#N/A"}},{"$f":"VLOOKUP($P4,$I$4:$L$48,4,FALSE)","v":{"$error":"#N/A"}},35,1,{"$f":"IF(P4=0,0,1)","v":0},{"$f":"IF(ISBLANK(S4),0,1-(S4/10))","v":0}]
[2,"_ _",33,null,null,{"$f":"C5+D5+E5","v":33},null,2,"_ _",33,null,null,{"$f":"J5+K5+L5","v":33},null,2,null,"","",null,0,{"$f":"SUM(V5:Z5)","v":{"$error":"#N/A"}},{"$f":"VLOOKUP($P5,$B$4:$E$48,3,FALSE)","v":{"$error":"#N/A"}},{"$f":"VLOOKUP($P5,$B$4:$E$48,4,FALSE)","v":{"$error":"#N/A"}},{"$f":"VLOOKUP($P5,$I$4:$L$48,3,FALSE)","v":{"$error":"#N/A"}},{"$f":"VLOOKUP($P5,$I$4:$L$48,4,FALSE)","v":{"$error":"#N/A"}},33,1,0,0]
[3,"_ _",31,null,null,31,null,3,"_ _",31,null,null,31,null,3,null,"","",null,0,{"$error":"#N/A"},{"$error":"#N/A"},{"$error":"#N/A"},{"$error":"#N/A"},{"$error":"#N/A"},31,1,0,0]
[4,"_ _",30,null,null,30,null,4,"_ _",30,null,null,30,null,4,null,"","",null,0,{"$error":"#N/A"},{"$error":"#N/A"},{"$error":"#N/A"},{"$error":"#N/A"},{"$error":"#N/A"},30,1,0,0]
[5,"_ _",29,null,null,29,null,5,"_ _",29,null,null,29,null,5,null,"","",null,0,{"$error":"#N/A"},{"$error":"#N/A"},{"$error":"#N/A"},{"$error":"#N/A"},{"$error":"#N/A"},29,1,0,0]
{"$rows_left_out":41}
{"sheet":"EKC3","index":4,"n_rows":48,"n_cols":29,"rows_kept":48,"cut":false,"hidden":false,"merged":[[1,21,1,22],[1,23,1,25]]}
[null,"Course 1",null,null,null,null,null,null,"Course 2",null,null,null,null,null,null,"Classement Global"]
[null,null,null,null,null,null,null,null,null,null,null,null,null,null,null,null,null,null,null,null,null,"C1",null,"C2"]
["Classt","Equipe","Points","Pole","MT","Total",null,"Classt","Equipe","Points","Pole","MT","Total",null,"Classt","Equipe","M1","M2","Best","Calcul","Total","Pole","MT","Pole","MT","Points",null,{"$f":"SUM(AB4:AB48)","v":0}]
[1,"_ _",35,null,null,{"$f":"C4+D4+E4","v":35},null,1,"_ _",35,null,null,{"$f":"J4+K4+L4","v":35},null,1,null,{"$f":"IF(ISNA(VLOOKUP($P4,$B$4:$F$48,5,FALSE)),\"\",VLOOKUP($P4,$B$4:$F$48,5,FALSE))","v":""},{"$f":"IF(ISNA(VLOOKUP($P4,$I$4:$M$48,5,FALSE)),\"\",VLOOKUP($P4,$I$4:$M$48,5,FALSE))","v":""},null,{"$f":"IF(ISERROR(Q4+R4),0,(Q4+R4))+IF(ISBLANK(S4),0,AC4)","v":0},{"$f":"SUM(V4:Z4)","v":{"$error":"#N/A"}},{"$f":"VLOOKUP($P4,$B$4:$E$48,3,FALSE)","v":{"$error":"#N/A"}},{"$f":"VLOOKUP($P4,$B$4:$E$48,4,FALSE)","v":{"$error":"#N/A"}},{"$f":"VLOOKUP($P4,$I$4:$L$48,3,FALSE)","v":{"$error":"#N/A"}},{"$f":"VLOOKUP($P4,$I$4:$L$48,4,FALSE)","v":{"$error":"#N/A"}},35,1,{"$f":"IF(P4=0,0,1)","v":0},{"$f":"IF(ISBLANK(S4),0,1-(S4/10))","v":0}]
[2,"_ _",33,null,null,{"$f":"C5+D5+E5","v":33},null,2,"_ _",33,null,null,{"$f":"J5+K5+L5","v":33},null,2,null,"","",null,0,{"$f":"SUM(V5:Z5)","v":{"$error":"#N/A"}},{"$f":"VLOOKUP($P5,$B$4:$E$48,3,FALSE)","v":{"$error":"#N/A"}},{"$f":"VLOOKUP($P5,$B$4:$E$48,4,FALSE)","v":{"$error":"#N/A"}},{"$f":"VLOOKUP($P5,$I$4:$L$48,3,FALSE)","v":{"$error":"#N/A"}},{"$f":"VLOOKUP($P5,$I$4:$L$48,4,FALSE)","v":{"$error":"#N/A"}},33,1,0,0]
[3,"_ _",31,null,null,31,null,3,"_ _",31,null,null,31,null,3,null,"","",null,0,{"$error":"#N/A"},{"$error":"#N/A"},{"$error":"#N/A"},{"$error":"#N/A"},{"$error":"#N/A"},31,1,0,0]
[4,"_ _",30,null,null,30,null,4,"_ _",30,null,null,30,null,4,null,"","",null,0,{"$error":"#N/A"},{"$error":"#N/A"},{"$error":"#N/A"},{"$error":"#N/A"},{"$error":"#N/A"},30,1,0,0]
[5,"_ _",29,null,null,29,null,5,"_ _",29,null,null,29,null,5,null,"","",null,0,{"$error":"#N/A"},{"$error":"#N/A"},{"$error":"#N/A"},{"$error":"#N/A"},{"$error":"#N/A"},29,1,0,0]
{"$rows_left_out":41}
{"sheet":"EKC4","index":5,"n_rows":48,"n_cols":29,"rows_kept":48,"cut":false,"hidden":false,"merged":[[1,21,1,22],[1,23,1,25]]}
[null,"Course 1",null,null,null,null,null,null,"Course 2",null,null,null,null,null,null,"Classement Global"]
[null,null,null,null,null,null,null,null,null,null,null,null,null,null,null,null,null,null,null,null,null,"C1",null,"C2"]
["Classt","Equipe","Points","Pole","MT","Total",null,"Classt","Equipe","Points","Pole","MT","Total",null,"Classt","Equipe","M1","M2","Best","Calcul","Total","Pole","MT","Pole","MT","Points",null,{"$f":"SUM(AB4:AB48)","v":0}]
[1,"_ _",35,null,null,{"$f":"C4+D4+E4","v":35},null,1,"_ _",35,null,null,{"$f":"J4+K4+L4","v":35},null,1,null,{"$f":"IF(ISNA(VLOOKUP($P4,$B$4:$F$48,5,FALSE)),\"\",VLOOKUP($P4,$B$4:$F$48,5,FALSE))","v":""},{"$f":"IF(ISNA(VLOOKUP($P4,$I$4:$M$48,5,FALSE)),\"\",VLOOKUP($P4,$I$4:$M$48,5,FALSE))","v":""},null,{"$f":"IF(ISERROR(Q4+R4),0,(Q4+R4))+IF(ISBLANK(S4),0,AC4)","v":0},{"$f":"SUM(V4:Z4)","v":{"$error":"#N/A"}},{"$f":"VLOOKUP($P4,$B$4:$E$48,3,FALSE)","v":{"$error":"#N/A"}},{"$f":"VLOOKUP($P4,$B$4:$E$48,4,FALSE)","v":{"$error":"#N/A"}},{"$f":"VLOOKUP($P4,$I$4:$L$48,3,FALSE)","v":{"$error":"#N/A"}},{"$f":"VLOOKUP($P4,$I$4:$L$48,4,FALSE)","v":{"$error":"#N/A"}},35,1,{"$f":"IF(P4=0,0,1)","v":0},{"$f":"IF(ISBLANK(S4),0,1-(S4/10))","v":0}]
[2,"_ _",33,null,null,{"$f":"C5+D5+E5","v":33},null,2,"_ _",33,null,null,{"$f":"J5+K5+L5","v":33},null,2,null,"","",null,0,{"$f":"SUM(V5:Z5)","v":{"$error":"#N/A"}},{"$f":"VLOOKUP($P5,$B$4:$E$48,3,FALSE)","v":{"$error":"#N/A"}},{"$f":"VLOOKUP($P5,$B$4:$E$48,4,FALSE)","v":{"$error":"#N/A"}},{"$f":"VLOOKUP($P5,$I$4:$L$48,3,FALSE)","v":{"$error":"#N/A"}},{"$f":"VLOOKUP($P5,$I$4:$L$48,4,FALSE)","v":{"$error":"#N/A"}},33,1,0,0]
[3,"_ _",31,null,null,31,null,3,"_ _",31,null,null,31,null,3,null,"","",null,0,{"$error":"#N/A"},{"$error":"#N/A"},{"$error":"#N/A"},{"$error":"#N/A"},{"$error":"#N/A"},31,1,0,0]
[4,"_ _",30,null,null,30,null,4,"_ _",30,null,null,30,null,4,null,"","",null,0,{"$error":"#N/A"},{"$error":"#N/A"},{"$error":"#N/A"},{"$error":"#N/A"},{"$error":"#N/A"},30,1,0,0]
[5,"_ _",29,null,null,29,null,5,"_ _",29,null,null,29,null,5,null,"","",null,0,{"$error":"#N/A"},{"$error":"#N/A"},{"$error":"#N/A"},{"$error":"#N/A"},{"$error":"#N/A"},29,1,0,0]
{"$rows_left_out":41}
{"sheet":"EKC5","index":6,"n_rows":48,"n_cols":29,"rows_kept":48,"cut":false,"hidden":false,"merged":[[1,21,1,22],[1,23,1,25]]}
[null,"Course 1",null,null,null,null,null,null,"Course 2",null,null,null,null,null,null,"Classement Global"]
[null,null,null,null,null,null,null,null,null,null,null,null,null,null,null,null,null,null,null,null,null,"C1",null,"C2"]
["Classt","Equipe","Points","Pole","MT","Total",null,"Classt","Equipe","Points","Pole","MT","Total",null,"Classt","Equipe","M1","M2","Best","Calcul","Total","Pole","MT","Pole","MT","Points",null,{"$f":"SUM(AB4:AB48)","v":0}]
[1,"_ _",35,null,null,{"$f":"C4+D4+E4","v":35},null,1,"_ _",35,null,null,{"$f":"J4+K4+L4","v":35},null,1,null,{"$f":"IF(ISNA(VLOOKUP($P4,$B$4:$F$48,5,FALSE)),\"\",VLOOKUP($P4,$B$4:$F$48,5,FALSE))","v":""},{"$f":"IF(ISNA(VLOOKUP($P4,$I$4:$M$48,5,FALSE)),\"\",VLOOKUP($P4,$I$4:$M$48,5,FALSE))","v":""},null,{"$f":"IF(ISERROR(Q4+R4),0,(Q4+R4))+IF(ISBLANK(S4),0,AC4)","v":0},{"$f":"SUM(V4:Z4)","v":{"$error":"#N/A"}},{"$f":"VLOOKUP($P4,$B$4:$E$48,3,FALSE)","v":{"$error":"#N/A"}},{"$f":"VLOOKUP($P4,$B$4:$E$48,4,FALSE)","v":{"$error":"#N/A"}},{"$f":"VLOOKUP($P4,$I$4:$L$48,3,FALSE)","v":{"$error":"#N/A"}},{"$f":"VLOOKUP($P4,$I$4:$L$48,4,FALSE)","v":{"$error":"#N/A"}},35,1,{"$f":"IF(P4=0,0,1)","v":0},{"$f":"IF(ISBLANK(S4),0,1-(S4/10))","v":0}]
[2,"_ _",33,null,null,{"$f":"C5+D5+E5","v":33},null,2,"_ _",33,null,null,{"$f":"J5+K5+L5","v":33},null,2,null,"","",null,0,{"$f":"SUM(V5:Z5)","v":{"$error":"#N/A"}},{"$f":"VLOOKUP($P5,$B$4:$E$48,3,FALSE)","v":{"$error":"#N/A"}},{"$f":"VLOOKUP($P5,$B$4:$E$48,4,FALSE)","v":{"$error":"#N/A"}},{"$f":"VLOOKUP($P5,$I$4:$L$48,3,FALSE)","v":{"$error":"#N/A"}},{"$f":"VLOOKUP($P5,$I$4:$L$48,4,FALSE)","v":{"$error":"#N/A"}},33,1,0,0]
[3,"_ _",31,null,null,31,null,3,"_ _",31,null,null,31,null,3,null,"","",null,0,{"$error":"#N/A"},{"$error":"#N/A"},{"$error":"#N/A"},{"$error":"#N/A"},{"$error":"#N/A"},31,1,0,0]
[4,"_ _",30,null,null,30,null,4,"_ _",30,null,null,30,null,4,null,"","",null,0,{"$error":"#N/A"},{"$error":"#N/A"},{"$error":"#N/A"},{"$error":"#N/A"},{"$error":"#N/A"},30,1,0,0]
[5,"_ _",29,null,null,29,null,5,"_ _",29,null,null,29,null,5,null,"","",null,0,{"$error":"#N/A"},{"$error":"#N/A"},{"$error":"#N/A"},{"$error":"#N/A"},{"$error":"#N/A"},29,1,0,0]
{"$rows_left_out":41}
{"sheet":"MODELE","index":7,"n_rows":48,"n_cols":29,"rows_kept":48,"cut":false,"hidden":false,"merged":[[1,21,1,22],[1,23,1,25]]}
[null,"Course 1",null,null,null,null,null,null,"Course 2",null,null,null,null,null,null,"Classement Global"]
[null,null,null,null,null,null,null,null,null,null,null,null,null,null,null,null,null,null,null,null,null,"C1",null,"C2"]
["Classt","Equipe","Points","Pole","MT","Total",null,"Classt","Equipe","Points","Pole","MT","Total",null,"Classt","Equipe","M1","M2","Best","Calcul","Total","Pole","MT","Pole","MT","Points",null,{"$f":"SUM(AB4:AB48)","v":0}]
[1,"_ _",35,null,null,{"$f":"C4+D4+E4","v":35},null,1,"_ _",35,null,null,{"$f":"J4+K4+L4","v":35},null,1,null,{"$f":"IF(ISNA(VLOOKUP($P4,$B$4:$F$48,5,FALSE)),\"\",VLOOKUP($P4,$B$4:$F$48,5,FALSE))","v":""},{"$f":"IF(ISNA(VLOOKUP($P4,$I$4:$M$48,5,FALSE)),\"\",VLOOKUP($P4,$I$4:$M$48,5,FALSE))","v":""},null,{"$f":"IF(ISERROR(Q4+R4),0,(Q4+R4))+IF(ISBLANK(S4),0,AC4)","v":0},{"$f":"SUM(V4:Z4)","v":{"$error":"#N/A"}},{"$f":"VLOOKUP($P4,$B$4:$E$48,3,FALSE)","v":{"$error":"#N/A"}},{"$f":"VLOOKUP($P4,$B$4:$E$48,4,FALSE)","v":{"$error":"#N/A"}},{"$f":"VLOOKUP($P4,$I$4:$L$48,3,FALSE)","v":{"$error":"#N/A"}},{"$f":"VLOOKUP($P4,$I$4:$L$48,4,FALSE)","v":{"$error":"#N/A"}},35,1,{"$f":"IF(P4=0,0,1)","v":0},{"$f":"IF(ISBLANK(S4),0,1-(S4/10))","v":0}]
[2,"_ _",33,null,null,{"$f":"C5+D5+E5","v":33},null,2,"_ _",33,null,null,{"$f":"J5+K5+L5","v":33},null,2,null,"","",null,0,{"$f":"SUM(V5:Z5)","v":{"$error":"#N/A"}},{"$f":"VLOOKUP($P5,$B$4:$E$48,3,FALSE)","v":{"$error":"#N/A"}},{"$f":"VLOOKUP($P5,$B$4:$E$48,4,FALSE)","v":{"$error":"#N/A"}},{"$f":"VLOOKUP($P5,$I$4:$L$48,3,FALSE)","v":{"$error":"#N/A"}},{"$f":"VLOOKUP($P5,$I$4:$L$48,4,FALSE)","v":{"$error":"#N/A"}},33,1,0,0]
[3,"_ _",31,null,null,31,null,3,"_ _",31,null,null,31,null,3,null,"","",null,0,{"$error":"#N/A"},{"$error":"#N/A"},{"$error":"#N/A"},{"$error":"#N/A"},{"$error":"#N/A"},31,1,0,0]
[4,"_ _",30,null,null,30,null,4,"_ _",30,null,null,30,null,4,null,"","",null,0,{"$error":"#N/A"},{"$error":"#N/A"},{"$error":"#N/A"},{"$error":"#N/A"},{"$error":"#N/A"},30,1,0,0]
[5,"_ _",29,null,null,29,null,5,"_ _",29,null,null,29,null,5,null,"","",null,0,{"$error":"#N/A"},{"$error":"#N/A"},{"$error":"#N/A"},{"$error":"#N/A"},{"$error":"#N/A"},29,1,0,0]
{"$rows_left_out":41}
{"sheet":"Feuil3","index":8,"n_rows":0,"n_cols":0,"rows_kept":0,"cut":false,"hidden":false,"merged":[]}